BDBM50203699 CHEMBL3977066
SMILES: COc1ncc(cc1C#N)-c1ccc2ncnc(-c3cccc(c3)C(=O)N3CCN(CC3)C(C)=O)c2c1
InChI Key: InChIKey=QYTXJLQBSYAMGR-UHFFFAOYSA-N
Data: 29 IC50
PDB links: 2 PDB IDs match this monomer.
Activity Spreadsheet -- Enzyme Inhibition Constant Data from BindingDB
Found 29 hits for monomerid = 50203699
Trg + Lig
Ki
nM
ΔG°
kcal/mole
IC50
nM
Kd
nM
EC50/IC50
nM
koff
s-1
kon
M-1s-1
pHTemp
°C
Phosphatidylinositol 4,5-bisphosphate 3-kinase catalytic subunit delta isoform
(Mus musculus (Mouse))
BDBM50203699
(CHEMBL3977066)
Show SMILES COc1ncc(cc1C#N)-c1ccc2ncnc(-c3cccc(c3)C(=O)N3CCN(CC3)C(C)=O)c2c1
Show InChI InChI=1S/C28H24N6O3/c1-18(35)33-8-10-34(11-9-33)28(36)21-5-3-4-20(12-21)26-24-14-19(6-7-25(24)31-17-32-26)23-13-22(15-29)27(37-2)30-16-23/h3-7,12-14,16-17H,8-11H2,1-2H3
n/an/a 74n/an/an/an/an/an/a
Novartis Institutes for BioMedical Research
Curated by ChEMBL
Assay Description
Inhibition of PI3K-delta in mouse splenocytes assessed as inhibition anti-IgM induced CD86 expression
Bioorg Med Chem Lett 26: 5657-5662 (2016)
Article DOI: 10.1016/j.bmcl.2016.10.069
BindingDB Entry DOI: 10.7270/Q20Z7574
3D
3D Structure (crystal)
Phosphatidylinositol 4,5-bisphosphate 3-kinase catalytic subunit alpha isoform
(Homo sapiens (Human))
BDBM50203699
(CHEMBL3977066)
Show SMILES COc1ncc(cc1C#N)-c1ccc2ncnc(-c3cccc(c3)C(=O)N3CCN(CC3)C(C)=O)c2c1
Show InChI InChI=1S/C28H24N6O3/c1-18(35)33-8-10-34(11-9-33)28(36)21-5-3-4-20(12-21)26-24-14-19(6-7-25(24)31-17-32-26)23-13-22(15-29)27(37-2)30-16-23/h3-7,12-14,16-17H,8-11H2,1-2H3
NCI pathway
Reactome pathway
n/an/a 262n/an/an/an/an/an/a
Novartis Institutes for BioMedical Research
Curated by ChEMBL
Assay Description
Inhibition of recombinant PI3Kalpha (unknown origin) using phosphatidyl inositol as substrate after 30 to 60 mins in presence of ATP by Kinase Glo lu...
ACS Med Chem Lett 7: 762-7 (2016)
Article DOI: 10.1021/acsmedchemlett.6b00119
3D
3D Structure (crystal)
Phosphatidylinositol 4,5-bisphosphate 3-kinase catalytic subunit beta isoform
(Homo sapiens (Human))
BDBM50203699
(CHEMBL3977066)
Show SMILES COc1ncc(cc1C#N)-c1ccc2ncnc(-c3cccc(c3)C(=O)N3CCN(CC3)C(C)=O)c2c1
Show InChI InChI=1S/C28H24N6O3/c1-18(35)33-8-10-34(11-9-33)28(36)21-5-3-4-20(12-21)26-24-14-19(6-7-25(24)31-17-32-26)23-13-22(15-29)27(37-2)30-16-23/h3-7,12-14,16-17H,8-11H2,1-2H3
NCI pathway
Reactome pathway
n/an/a 6.53E+3n/an/an/an/an/an/a
Novartis Institutes for BioMedical Research
Curated by ChEMBL
Assay Description
Inhibition of myristoylated PI3K-beta (unknown origin) overexpressed in Rat1 cells assessed as inhibition of Akt phosphorylation
Bioorg Med Chem Lett 26: 5657-5662 (2016)
Article DOI: 10.1016/j.bmcl.2016.10.069
BindingDB Entry DOI: 10.7270/Q20Z7574
Phosphatidylinositol 4,5-bisphosphate 3-kinase catalytic subunit delta isoform
(Homo sapiens (Human))
BDBM50203699
(CHEMBL3977066)
Show SMILES COc1ncc(cc1C#N)-c1ccc2ncnc(-c3cccc(c3)C(=O)N3CCN(CC3)C(C)=O)c2c1
Show InChI InChI=1S/C28H24N6O3/c1-18(35)33-8-10-34(11-9-33)28(36)21-5-3-4-20(12-21)26-24-14-19(6-7-25(24)31-17-32-26)23-13-22(15-29)27(37-2)30-16-23/h3-7,12-14,16-17H,8-11H2,1-2H3
NCI pathway
Reactome pathway
n/an/a 49n/an/an/an/an/an/a
Novartis Institutes for BioMedical Research
Curated by ChEMBL
Assay Description
Inhibition of myristoylated PI3K-delta (unknown origin) overexpressed in Rat1 cells assessed as inhibition of Akt phosphorylation
Bioorg Med Chem Lett 26: 5657-5662 (2016)
Article DOI: 10.1016/j.bmcl.2016.10.069
BindingDB Entry DOI: 10.7270/Q20Z7574
3D
3D Structure (crystal)
Phosphatidylinositol 4,5-bisphosphate 3-kinase catalytic subunit delta isoform
(Homo sapiens (Human))
BDBM50203699
(CHEMBL3977066)
Show SMILES COc1ncc(cc1C#N)-c1ccc2ncnc(-c3cccc(c3)C(=O)N3CCN(CC3)C(C)=O)c2c1
Show InChI InChI=1S/C28H24N6O3/c1-18(35)33-8-10-34(11-9-33)28(36)21-5-3-4-20(12-21)26-24-14-19(6-7-25(24)31-17-32-26)23-13-22(15-29)27(37-2)30-16-23/h3-7,12-14,16-17H,8-11H2,1-2H3
NCI pathway
Reactome pathway
n/an/a 7n/an/an/an/an/an/a
Novartis Institutes for BioMedical Research
Curated by ChEMBL
Assay Description
Inhibition of PI3K-delta (unknown origin) by KinaseGlo assay
Bioorg Med Chem Lett 26: 5657-5662 (2016)
Article DOI: 10.1016/j.bmcl.2016.10.069
BindingDB Entry DOI: 10.7270/Q20Z7574
3D
3D Structure (crystal)
Phosphatidylinositol 4,5-bisphosphate 3-kinase catalytic subunit alpha isoform
(Homo sapiens (Human))
BDBM50203699
(CHEMBL3977066)
Show SMILES COc1ncc(cc1C#N)-c1ccc2ncnc(-c3cccc(c3)C(=O)N3CCN(CC3)C(C)=O)c2c1
Show InChI InChI=1S/C28H24N6O3/c1-18(35)33-8-10-34(11-9-33)28(36)21-5-3-4-20(12-21)26-24-14-19(6-7-25(24)31-17-32-26)23-13-22(15-29)27(37-2)30-16-23/h3-7,12-14,16-17H,8-11H2,1-2H3
NCI pathway
Reactome pathway
n/an/a 3.44E+3n/an/an/an/an/an/a
Novartis Institutes for BioMedical Research
Curated by ChEMBL
Assay Description
Inhibition of myristoylated PI3K-alpha (unknown origin) overexpressed in Rat1 cells assessed as inhibition of Akt phosphorylation
Bioorg Med Chem Lett 26: 5657-5662 (2016)
Article DOI: 10.1016/j.bmcl.2016.10.069
BindingDB Entry DOI: 10.7270/Q20Z7574
3D
3D Structure (crystal)
Phosphatidylinositol 4,5-bisphosphate 3-kinase catalytic subunit gamma isoform
(Homo sapiens (Human))
BDBM50203699
(CHEMBL3977066)
Show SMILES COc1ncc(cc1C#N)-c1ccc2ncnc(-c3cccc(c3)C(=O)N3CCN(CC3)C(C)=O)c2c1
Show InChI InChI=1S/C28H24N6O3/c1-18(35)33-8-10-34(11-9-33)28(36)21-5-3-4-20(12-21)26-24-14-19(6-7-25(24)31-17-32-26)23-13-22(15-29)27(37-2)30-16-23/h3-7,12-14,16-17H,8-11H2,1-2H3
NCI pathway
Reactome pathway
n/an/a 4.63E+3n/an/an/an/an/an/a
Novartis Institutes for BioMedical Research
Curated by ChEMBL
Assay Description
Inhibition of PI3K-gamma (unknown origin) by KinaseGlo assay
Bioorg Med Chem Lett 26: 5657-5662 (2016)
Article DOI: 10.1016/j.bmcl.2016.10.069
BindingDB Entry DOI: 10.7270/Q20Z7574
Phosphatidylinositol 4,5-bisphosphate 3-kinase catalytic subunit alpha isoform
(Homo sapiens (Human))
BDBM50203699
(CHEMBL3977066)
Show SMILES COc1ncc(cc1C#N)-c1ccc2ncnc(-c3cccc(c3)C(=O)N3CCN(CC3)C(C)=O)c2c1
Show InChI InChI=1S/C28H24N6O3/c1-18(35)33-8-10-34(11-9-33)28(36)21-5-3-4-20(12-21)26-24-14-19(6-7-25(24)31-17-32-26)23-13-22(15-29)27(37-2)30-16-23/h3-7,12-14,16-17H,8-11H2,1-2H3
NCI pathway
Reactome pathway
n/an/a 262n/an/an/an/an/an/a
Novartis Institutes for BioMedical Research
Curated by ChEMBL
Assay Description
Inhibition of PI3K-alpha (unknown origin) by KinaseGlo assay
Bioorg Med Chem Lett 26: 5657-5662 (2016)
Article DOI: 10.1016/j.bmcl.2016.10.069
BindingDB Entry DOI: 10.7270/Q20Z7574
3D
3D Structure (crystal)
Phosphatidylinositol 4,5-bisphosphate 3-kinase catalytic subunit alpha isoform
(Homo sapiens (Human))
BDBM50203699
(CHEMBL3977066)
Show SMILES COc1ncc(cc1C#N)-c1ccc2ncnc(-c3cccc(c3)C(=O)N3CCN(CC3)C(C)=O)c2c1
Show InChI InChI=1S/C28H24N6O3/c1-18(35)33-8-10-34(11-9-33)28(36)21-5-3-4-20(12-21)26-24-14-19(6-7-25(24)31-17-32-26)23-13-22(15-29)27(37-2)30-16-23/h3-7,12-14,16-17H,8-11H2,1-2H3
NCI pathway
Reactome pathway
n/an/a 262n/an/an/an/an/an/a
Novartis Institutes for BioMedical Research
Curated by ChEMBL
Assay Description
Inhibition of recombinant PI3Kalpha (unknown origin) using phosphatidyl inositol/n-Octyl-glucoside as substrate measured after 30 mins by KinaseGlo a...
ACS Med Chem Lett 8: 975-980 (2017)
Article DOI: 10.1021/acsmedchemlett.7b00293
BindingDB Entry DOI: 10.7270/Q2SX6GR0
3D
3D Structure (crystal)
Phosphatidylinositol 4,5-bisphosphate 3-kinase catalytic subunit delta isoform
(Homo sapiens (Human))
BDBM50203699
(CHEMBL3977066)
Show SMILES COc1ncc(cc1C#N)-c1ccc2ncnc(-c3cccc(c3)C(=O)N3CCN(CC3)C(C)=O)c2c1
Show InChI InChI=1S/C28H24N6O3/c1-18(35)33-8-10-34(11-9-33)28(36)21-5-3-4-20(12-21)26-24-14-19(6-7-25(24)31-17-32-26)23-13-22(15-29)27(37-2)30-16-23/h3-7,12-14,16-17H,8-11H2,1-2H3
NCI pathway
Reactome pathway
n/an/a 49n/an/an/an/an/an/a
Novartis Institutes for BioMedical Research
Curated by ChEMBL
Assay Description
Inhibition of recombinant human myristoylated PI3Kdelta catalytic domain expressed in Rat1 cells assessed as reduction in Akt phosphorylation at Ser4...
ACS Med Chem Lett 8: 975-980 (2017)
Article DOI: 10.1021/acsmedchemlett.7b00293
BindingDB Entry DOI: 10.7270/Q2SX6GR0
3D
3D Structure (crystal)
Phosphatidylinositol 4,5-bisphosphate 3-kinase catalytic subunit beta isoform
(Homo sapiens (Human))
BDBM50203699
(CHEMBL3977066)
Show SMILES COc1ncc(cc1C#N)-c1ccc2ncnc(-c3cccc(c3)C(=O)N3CCN(CC3)C(C)=O)c2c1
Show InChI InChI=1S/C28H24N6O3/c1-18(35)33-8-10-34(11-9-33)28(36)21-5-3-4-20(12-21)26-24-14-19(6-7-25(24)31-17-32-26)23-13-22(15-29)27(37-2)30-16-23/h3-7,12-14,16-17H,8-11H2,1-2H3
NCI pathway
Reactome pathway
n/an/a 1.65E+3n/an/an/an/an/an/a
Novartis Institutes for BioMedical Research
Curated by ChEMBL
Assay Description
Inhibition of recombinant PI3Kbeta (unknown origin) using phosphatidyl inositol/n-Octyl-glucoside as substrate measured after 60 mins by KinaseGlo as...
ACS Med Chem Lett 8: 975-980 (2017)
Article DOI: 10.1021/acsmedchemlett.7b00293
BindingDB Entry DOI: 10.7270/Q2SX6GR0
Phosphatidylinositol 4,5-bisphosphate 3-kinase catalytic subunit gamma isoform
(Homo sapiens (Human))
BDBM50203699
(CHEMBL3977066)
Show SMILES COc1ncc(cc1C#N)-c1ccc2ncnc(-c3cccc(c3)C(=O)N3CCN(CC3)C(C)=O)c2c1
Show InChI InChI=1S/C28H24N6O3/c1-18(35)33-8-10-34(11-9-33)28(36)21-5-3-4-20(12-21)26-24-14-19(6-7-25(24)31-17-32-26)23-13-22(15-29)27(37-2)30-16-23/h3-7,12-14,16-17H,8-11H2,1-2H3
NCI pathway
Reactome pathway
n/an/a 4.63E+3n/an/an/an/an/an/a
Novartis Institutes for BioMedical Research
Curated by ChEMBL
Assay Description
Inhibition of PI3Kgamma (unknown origin) using phosphatidyl inositol as substrate measured after 30 mins by Alexa Fluor647-labelled ADP tracer based ...
ACS Med Chem Lett 8: 975-980 (2017)
Article DOI: 10.1021/acsmedchemlett.7b00293
BindingDB Entry DOI: 10.7270/Q2SX6GR0
Phosphatidylinositol 4,5-bisphosphate 3-kinase catalytic subunit delta isoform
(Mus musculus (Mouse))
BDBM50203699
(CHEMBL3977066)
Show SMILES COc1ncc(cc1C#N)-c1ccc2ncnc(-c3cccc(c3)C(=O)N3CCN(CC3)C(C)=O)c2c1
Show InChI InChI=1S/C28H24N6O3/c1-18(35)33-8-10-34(11-9-33)28(36)21-5-3-4-20(12-21)26-24-14-19(6-7-25(24)31-17-32-26)23-13-22(15-29)27(37-2)30-16-23/h3-7,12-14,16-17H,8-11H2,1-2H3
n/an/a 48n/an/an/an/an/an/a
Novartis Institutes for BioMedical Research
Curated by ChEMBL
Assay Description
Inhibition of PI3Kdelta in Balb/c mouse splenocytes assessed as reduction in anti-IgM stimulated CD86 expression pretreated for 1 hr followed by anti...
ACS Med Chem Lett 8: 975-980 (2017)
Article DOI: 10.1021/acsmedchemlett.7b00293
BindingDB Entry DOI: 10.7270/Q2SX6GR0
3D
3D Structure (crystal)
Phosphatidylinositol 4,5-bisphosphate 3-kinase catalytic subunit beta isoform
(Homo sapiens (Human))
BDBM50203699
(CHEMBL3977066)
Show SMILES COc1ncc(cc1C#N)-c1ccc2ncnc(-c3cccc(c3)C(=O)N3CCN(CC3)C(C)=O)c2c1
Show InChI InChI=1S/C28H24N6O3/c1-18(35)33-8-10-34(11-9-33)28(36)21-5-3-4-20(12-21)26-24-14-19(6-7-25(24)31-17-32-26)23-13-22(15-29)27(37-2)30-16-23/h3-7,12-14,16-17H,8-11H2,1-2H3
NCI pathway
Reactome pathway
n/an/a 6.53E+3n/an/an/an/an/an/a
Novartis Institutes for BioMedical Research
Curated by ChEMBL
Assay Description
Inhibition of recombinant human myristoylated PI3Kbeta catalytic domain expressed in Rat1 cells assessed as reduction in Akt phosphorylation at Ser47...
ACS Med Chem Lett 8: 975-980 (2017)
Article DOI: 10.1021/acsmedchemlett.7b00293
BindingDB Entry DOI: 10.7270/Q2SX6GR0
Phosphatidylinositol 4,5-bisphosphate 3-kinase catalytic subunit alpha isoform
(Homo sapiens (Human))
BDBM50203699
(CHEMBL3977066)
Show SMILES COc1ncc(cc1C#N)-c1ccc2ncnc(-c3cccc(c3)C(=O)N3CCN(CC3)C(C)=O)c2c1
Show InChI InChI=1S/C28H24N6O3/c1-18(35)33-8-10-34(11-9-33)28(36)21-5-3-4-20(12-21)26-24-14-19(6-7-25(24)31-17-32-26)23-13-22(15-29)27(37-2)30-16-23/h3-7,12-14,16-17H,8-11H2,1-2H3
NCI pathway
Reactome pathway
n/an/a 3.44E+3n/an/an/an/an/an/a
Novartis Institutes for BioMedical Research
Curated by ChEMBL
Assay Description
Inhibition of recombinant human myristoylated PI3Kalpha catalytic domain expressed in Rat1 cells assessed as reduction in Akt phosphorylation at Ser4...
ACS Med Chem Lett 8: 975-980 (2017)
Article DOI: 10.1021/acsmedchemlett.7b00293
BindingDB Entry DOI: 10.7270/Q2SX6GR0
3D
3D Structure (crystal)
Phosphatidylinositol 4,5-bisphosphate 3-kinase catalytic subunit delta isoform
(Homo sapiens (Human))
BDBM50203699
(CHEMBL3977066)
Show SMILES COc1ncc(cc1C#N)-c1ccc2ncnc(-c3cccc(c3)C(=O)N3CCN(CC3)C(C)=O)c2c1
Show InChI InChI=1S/C28H24N6O3/c1-18(35)33-8-10-34(11-9-33)28(36)21-5-3-4-20(12-21)26-24-14-19(6-7-25(24)31-17-32-26)23-13-22(15-29)27(37-2)30-16-23/h3-7,12-14,16-17H,8-11H2,1-2H3
NCI pathway
Reactome pathway
n/an/a 9n/an/an/an/an/an/a
Novartis Institutes for BioMedical Research
Curated by ChEMBL
Assay Description
Inhibition of PI3Kdelta (unknown origin) using phosphatidyl inositol as substrate measured after 60 mins by Alexa Fluor647-labelled ADP tracer based ...
ACS Med Chem Lett 8: 975-980 (2017)
Article DOI: 10.1021/acsmedchemlett.7b00293
BindingDB Entry DOI: 10.7270/Q2SX6GR0
3D
3D Structure (crystal)
Phosphatidylinositol 4,5-bisphosphate 3-kinase catalytic subunit delta isoform
(Homo sapiens (Human))
BDBM50203699
(CHEMBL3977066)
Show SMILES COc1ncc(cc1C#N)-c1ccc2ncnc(-c3cccc(c3)C(=O)N3CCN(CC3)C(C)=O)c2c1
Show InChI InChI=1S/C28H24N6O3/c1-18(35)33-8-10-34(11-9-33)28(36)21-5-3-4-20(12-21)26-24-14-19(6-7-25(24)31-17-32-26)23-13-22(15-29)27(37-2)30-16-23/h3-7,12-14,16-17H,8-11H2,1-2H3
NCI pathway
Reactome pathway
n/an/a 125n/an/an/an/an/an/a
Novartis Institutes for BioMedical Research
Curated by ChEMBL
Assay Description
Inhibition of PI3Kdelta in human B cells assessed as reduction in anti-human IgM stimulated CD69 expression preincubated for 1 hr followed by anti-hu...
ACS Med Chem Lett 7: 762-7 (2016)
Article DOI: 10.1021/acsmedchemlett.6b00119
3D
3D Structure (crystal)
PI3K p110 delta/p85 alpha
(Mus musculus (Mouse))
BDBM50203699
(CHEMBL3977066)
Show SMILES COc1ncc(cc1C#N)-c1ccc2ncnc(-c3cccc(c3)C(=O)N3CCN(CC3)C(C)=O)c2c1
Show InChI InChI=1S/C28H24N6O3/c1-18(35)33-8-10-34(11-9-33)28(36)21-5-3-4-20(12-21)26-24-14-19(6-7-25(24)31-17-32-26)23-13-22(15-29)27(37-2)30-16-23/h3-7,12-14,16-17H,8-11H2,1-2H3
n/an/a 11n/an/an/an/an/an/a
Novartis Institutes for BioMedical Research
Curated by ChEMBL
Assay Description
Inhibition of PI3Kdelta in Balb/c mouse in rat B cells assessed as reduction in anti-IgM induced proliferation measured over last 16 hrs of 88 hrs by...
ACS Med Chem Lett 7: 762-7 (2016)
Article DOI: 10.1021/acsmedchemlett.6b00119
3D
3D Structure (crystal)
Phosphatidylinositol 4,5-bisphosphate 3-kinase catalytic subunit beta isoform
(Homo sapiens (Human))
BDBM50203699
(CHEMBL3977066)
Show SMILES COc1ncc(cc1C#N)-c1ccc2ncnc(-c3cccc(c3)C(=O)N3CCN(CC3)C(C)=O)c2c1
Show InChI InChI=1S/C28H24N6O3/c1-18(35)33-8-10-34(11-9-33)28(36)21-5-3-4-20(12-21)26-24-14-19(6-7-25(24)31-17-32-26)23-13-22(15-29)27(37-2)30-16-23/h3-7,12-14,16-17H,8-11H2,1-2H3
NCI pathway
Reactome pathway
n/an/a 1.65E+3n/an/an/an/an/an/a
Novartis Institutes for BioMedical Research
Curated by ChEMBL
Assay Description
Inhibition of recombinant PI3Kbeta (unknown origin) using phosphatidyl inositol as substrate after 30 to 60 mins in presence of ATP by Kinase Glo lum...
ACS Med Chem Lett 7: 762-7 (2016)
Article DOI: 10.1021/acsmedchemlett.6b00119
Phosphatidylinositol 4,5-bisphosphate 3-kinase catalytic subunit gamma isoform
(Homo sapiens (Human))
BDBM50203699
(CHEMBL3977066)
Show SMILES COc1ncc(cc1C#N)-c1ccc2ncnc(-c3cccc(c3)C(=O)N3CCN(CC3)C(C)=O)c2c1
Show InChI InChI=1S/C28H24N6O3/c1-18(35)33-8-10-34(11-9-33)28(36)21-5-3-4-20(12-21)26-24-14-19(6-7-25(24)31-17-32-26)23-13-22(15-29)27(37-2)30-16-23/h3-7,12-14,16-17H,8-11H2,1-2H3
NCI pathway
Reactome pathway
n/an/a 4.63E+3n/an/an/an/an/an/a
Novartis Institutes for BioMedical Research
Curated by ChEMBL
Assay Description
Inhibition of PI3Kgamma (unknown origin) assessed as reduction in ADP formation using phosphatidyl inositol as substrate after 30 to 60 mins by TR-FR...
ACS Med Chem Lett 7: 762-7 (2016)
Article DOI: 10.1021/acsmedchemlett.6b00119
Phosphatidylinositol 4,5-bisphosphate 3-kinase catalytic subunit alpha isoform
(Homo sapiens (Human))
BDBM50203699
(CHEMBL3977066)
Show SMILES COc1ncc(cc1C#N)-c1ccc2ncnc(-c3cccc(c3)C(=O)N3CCN(CC3)C(C)=O)c2c1
Show InChI InChI=1S/C28H24N6O3/c1-18(35)33-8-10-34(11-9-33)28(36)21-5-3-4-20(12-21)26-24-14-19(6-7-25(24)31-17-32-26)23-13-22(15-29)27(37-2)30-16-23/h3-7,12-14,16-17H,8-11H2,1-2H3
NCI pathway
Reactome pathway
n/an/a 3.44E+3n/an/an/an/an/an/a
Novartis Institutes for BioMedical Research
Curated by ChEMBL
Assay Description
Inhibition of human PI3Kalpha expressed in rat-1 fibroblasts assessed as reduction in Akt phosphorylation at Ser 473 after 1 hr by alphascreen assay
ACS Med Chem Lett 7: 762-7 (2016)
Article DOI: 10.1021/acsmedchemlett.6b00119
3D
3D Structure (crystal)
Phosphatidylinositol 4,5-bisphosphate 3-kinase catalytic subunit beta isoform
(Homo sapiens (Human))
BDBM50203699
(CHEMBL3977066)
Show SMILES COc1ncc(cc1C#N)-c1ccc2ncnc(-c3cccc(c3)C(=O)N3CCN(CC3)C(C)=O)c2c1
Show InChI InChI=1S/C28H24N6O3/c1-18(35)33-8-10-34(11-9-33)28(36)21-5-3-4-20(12-21)26-24-14-19(6-7-25(24)31-17-32-26)23-13-22(15-29)27(37-2)30-16-23/h3-7,12-14,16-17H,8-11H2,1-2H3
NCI pathway
Reactome pathway
n/an/a 6.53E+3n/an/an/an/an/an/a
Novartis Institutes for BioMedical Research
Curated by ChEMBL
Assay Description
Inhibition of human PI3Kbeta expressed in rat-1 fibroblasts assessed as reduction in Akt phosphorylation at Ser 473 after 1 hr by alphascreen assay
ACS Med Chem Lett 7: 762-7 (2016)
Article DOI: 10.1021/acsmedchemlett.6b00119
Phosphatidylinositol 4,5-bisphosphate 3-kinase catalytic subunit delta isoform
(Homo sapiens (Human))
BDBM50203699
(CHEMBL3977066)
Show SMILES COc1ncc(cc1C#N)-c1ccc2ncnc(-c3cccc(c3)C(=O)N3CCN(CC3)C(C)=O)c2c1
Show InChI InChI=1S/C28H24N6O3/c1-18(35)33-8-10-34(11-9-33)28(36)21-5-3-4-20(12-21)26-24-14-19(6-7-25(24)31-17-32-26)23-13-22(15-29)27(37-2)30-16-23/h3-7,12-14,16-17H,8-11H2,1-2H3
NCI pathway
Reactome pathway
n/an/a 49n/an/an/an/an/an/a
Novartis Institutes for BioMedical Research
Curated by ChEMBL
Assay Description
Inhibition of human PI3Kdelta expressed in rat-1 fibroblasts assessed as reduction in Akt phosphorylation at Ser 473 after 1 hr by alphascreen assay
ACS Med Chem Lett 7: 762-7 (2016)
Article DOI: 10.1021/acsmedchemlett.6b00119
3D
3D Structure (crystal)
1,3-beta-glucan synthase component GLS2
(Saccharomyces cerevisiae)
BDBM50203699
(CHEMBL3977066)
Show SMILES COc1ncc(cc1C#N)-c1ccc2ncnc(-c3cccc(c3)C(=O)N3CCN(CC3)C(C)=O)c2c1
Show InChI InChI=1S/C28H24N6O3/c1-18(35)33-8-10-34(11-9-33)28(36)21-5-3-4-20(12-21)26-24-14-19(6-7-25(24)31-17-32-26)23-13-22(15-29)27(37-2)30-16-23/h3-7,12-14,16-17H,8-11H2,1-2H3
n/an/a>3.00E+4n/an/an/an/an/an/a
Novartis Institutes for BioMedical Research
Curated by ChEMBL
Assay Description
Displacement of [3H]dofetilide from recombinant human ERG transfected in HEK293 cell membranes after 60 mins by scintillation counting
ACS Med Chem Lett 7: 762-7 (2016)
Article DOI: 10.1021/acsmedchemlett.6b00119
Phosphatidylinositol 4,5-bisphosphate 3-kinase catalytic subunit delta isoform
(Homo sapiens (Human))
BDBM50203699
(CHEMBL3977066)
Show SMILES COc1ncc(cc1C#N)-c1ccc2ncnc(-c3cccc(c3)C(=O)N3CCN(CC3)C(C)=O)c2c1
Show InChI InChI=1S/C28H24N6O3/c1-18(35)33-8-10-34(11-9-33)28(36)21-5-3-4-20(12-21)26-24-14-19(6-7-25(24)31-17-32-26)23-13-22(15-29)27(37-2)30-16-23/h3-7,12-14,16-17H,8-11H2,1-2H3
NCI pathway
Reactome pathway
n/an/a 29n/an/an/an/an/an/a
Novartis Institutes for BioMedical Research
Curated by ChEMBL
Assay Description
Inhibition of PI3Kdelta in human B cells assessed as reduction in anti-human IgM stimulated intracellular Akt phosphorylation at Ser 473 preincubated...
ACS Med Chem Lett 7: 762-7 (2016)
Article DOI: 10.1021/acsmedchemlett.6b00119
3D
3D Structure (crystal)
Phosphatidylinositol 4,5-bisphosphate 3-kinase catalytic subunit delta isoform
(Homo sapiens (Human))
BDBM50203699
(CHEMBL3977066)
Show SMILES COc1ncc(cc1C#N)-c1ccc2ncnc(-c3cccc(c3)C(=O)N3CCN(CC3)C(C)=O)c2c1
Show InChI InChI=1S/C28H24N6O3/c1-18(35)33-8-10-34(11-9-33)28(36)21-5-3-4-20(12-21)26-24-14-19(6-7-25(24)31-17-32-26)23-13-22(15-29)27(37-2)30-16-23/h3-7,12-14,16-17H,8-11H2,1-2H3
NCI pathway
Reactome pathway
n/an/a 107n/an/an/an/an/an/a
Novartis Institutes for BioMedical Research
Curated by ChEMBL
Assay Description
Inhibition of PI3Kdelta in human B cells assessed as reduction in anti-human IgM stimulated CD86 expression preincubated for 1 hr followed by anti-hu...
ACS Med Chem Lett 7: 762-7 (2016)
Article DOI: 10.1021/acsmedchemlett.6b00119
3D
3D Structure (crystal)
PI3K p110 delta/p85 alpha
(Mus musculus (Mouse))
BDBM50203699
(CHEMBL3977066)
Show SMILES COc1ncc(cc1C#N)-c1ccc2ncnc(-c3cccc(c3)C(=O)N3CCN(CC3)C(C)=O)c2c1
Show InChI InChI=1S/C28H24N6O3/c1-18(35)33-8-10-34(11-9-33)28(36)21-5-3-4-20(12-21)26-24-14-19(6-7-25(24)31-17-32-26)23-13-22(15-29)27(37-2)30-16-23/h3-7,12-14,16-17H,8-11H2,1-2H3
n/an/a 70n/an/an/an/an/an/a
Novartis Institutes for BioMedical Research
Curated by ChEMBL
Assay Description
Inhibition of PI3Kdelta in Balb/c mouse B cells assessed as reduction in anti-IgM induced CD86 expression preincubated for 1 hr followed by anti-IgM ...
ACS Med Chem Lett 7: 762-7 (2016)
Article DOI: 10.1021/acsmedchemlett.6b00119
3D
3D Structure (crystal)
Phosphatidylinositol 4,5-bisphosphate 3-kinase catalytic subunit delta isoform
(Homo sapiens (Human))
BDBM50203699
(CHEMBL3977066)
Show SMILES COc1ncc(cc1C#N)-c1ccc2ncnc(-c3cccc(c3)C(=O)N3CCN(CC3)C(C)=O)c2c1
Show InChI InChI=1S/C28H24N6O3/c1-18(35)33-8-10-34(11-9-33)28(36)21-5-3-4-20(12-21)26-24-14-19(6-7-25(24)31-17-32-26)23-13-22(15-29)27(37-2)30-16-23/h3-7,12-14,16-17H,8-11H2,1-2H3
NCI pathway
Reactome pathway
n/an/a 9n/an/an/an/an/an/a
Novartis Institutes for BioMedical Research
Curated by ChEMBL
Assay Description
Inhibition of PI3Kdelta (unknown origin) assessed as reduction in ADP formation using phosphatidyl inositol as substrate after 30 to 60 mins by TR-FR...
ACS Med Chem Lett 7: 762-7 (2016)
Article DOI: 10.1021/acsmedchemlett.6b00119
3D
3D Structure (crystal)
Phosphatidylinositol 4,5-bisphosphate 3-kinase catalytic subunit beta isoform
(Homo sapiens (Human))
BDBM50203699
(CHEMBL3977066)
Show SMILES COc1ncc(cc1C#N)-c1ccc2ncnc(-c3cccc(c3)C(=O)N3CCN(CC3)C(C)=O)c2c1
Show InChI InChI=1S/C28H24N6O3/c1-18(35)33-8-10-34(11-9-33)28(36)21-5-3-4-20(12-21)26-24-14-19(6-7-25(24)31-17-32-26)23-13-22(15-29)27(37-2)30-16-23/h3-7,12-14,16-17H,8-11H2,1-2H3
NCI pathway
Reactome pathway
n/an/a 1.65E+3n/an/an/an/an/an/a
Novartis Institutes for BioMedical Research
Curated by ChEMBL
Assay Description
Inhibition of PI3K-beta (unknown origin) by KinaseGlo assay
Bioorg Med Chem Lett 26: 5657-5662 (2016)
Article DOI: 10.1016/j.bmcl.2016.10.069
BindingDB Entry DOI: 10.7270/Q20Z7574