BDBM50203784 (2S)-2-[(2S)-2-[(2S)-2-{2-[(2S)-2-[(2S)-2-[(2S)-2-[(2S)-2-[(2S)-2-[(2S)-2-[(2S)-2-{[(2S)-1-[(2S)-2-amino-4-methylpentanoyl]pyrrolidin-2-yl]formamido}-3-carbamoylpropanamido]-3-(4-hydroxyphenyl)propanamido]-3-carbamoylpropanamido]-3-(1H-indol-3-yl)propanamido]-3-carbamoylpropanamido]-3-hydroxypropanamido]-3-phenylpropanamido]acetamido}-4-methylpentanamido]-5-carbamimidamidopentanamido]pentanediamide::CHEMBL221817
SMILES: CC(C)C[C@H](N)C(=O)N1CCC[C@H]1C(=O)N[C@@H](CC(N)=O)C(=O)N[C@@H](Cc1ccc(O)cc1)C(=O)N[C@@H](CC(N)=O)C(=O)N[C@@H](Cc1c[nH]c2ccccc12)C(=O)N[C@@H](CC(N)=O)C(=O)N[C@@H](CO)C(=O)N[C@@H](Cc1ccccc1)C(=O)NCC(=O)N[C@@H](CC(C)C)C(=O)N[C@@H](CCCN=C(N)N)C(=O)N[C@@H](CCC(N)=O)C(N)=O
InChI Key: InChIKey=ZPLIBPJNZORWHQ-DVOIICMSSA-N
Data: 1 KI  1 EC50
Activity Spreadsheet -- Enzyme Inhibition Constant Data from BindingDB
Found 2 hits for monomerid = 50203784
Trg + Lig
Ki
nM
ΔG°
kcal/mole
IC50
nM
Kd
nM
EC50/IC50
nM
koff
s-1
kon
M-1s-1
pHTemp
°C
G-protein Coupled Receptor 54
(Homo sapiens (Human))
BDBM50203784
((2S)-2-[(2S)-2-[(2S)-2-{2-[(2S)-2-[(2S)-2-[(2S)-2-...)
Show SMILES CC(C)C[C@H](N)C(=O)N1CCC[C@H]1C(=O)N[C@@H](CC(N)=O)C(=O)N[C@@H](Cc1ccc(O)cc1)C(=O)N[C@@H](CC(N)=O)C(=O)N[C@@H](Cc1c[nH]c2ccccc12)C(=O)N[C@@H](CC(N)=O)C(=O)N[C@@H](CO)C(=O)N[C@@H](Cc1ccccc1)C(=O)NCC(=O)N[C@@H](CC(C)C)C(=O)N[C@@H](CCCN=C(N)N)C(=O)N[C@@H](CCC(N)=O)C(N)=O |wU:58.61,4.4,72.75,87.91,36.37,12.13,106.110,wD:66.69,24.24,95.99,16.16,44.45,(-20.28,-19.15,;-20.26,-20.69,;-21.58,-21.47,;-18.91,-21.43,;-18.9,-22.99,;-20.24,-23.76,;-17.57,-23.76,;-17.57,-25.3,;-16.25,-22.99,;-15.77,-21.53,;-14.22,-21.54,;-13.74,-22.99,;-14.99,-23.9,;-14.99,-25.44,;-16.34,-26.21,;-13.67,-26.22,;-13.67,-27.76,;-15,-28.52,;-15,-30.06,;-13.68,-30.84,;-16.33,-30.83,;-12.34,-28.53,;-12.34,-30.07,;-10.99,-27.76,;-9.66,-28.53,;-9.66,-30.07,;-8.33,-30.84,;-8.33,-32.38,;-7.01,-33.15,;-5.66,-32.38,;-4.33,-33.15,;-5.67,-30.83,;-6.99,-30.07,;-8.32,-27.76,;-8.32,-26.22,;-6.99,-28.53,;-5.66,-27.77,;-5.66,-26.23,;-4.32,-25.46,;-2.99,-26.23,;-4.32,-23.92,;-4.32,-28.54,;-4.33,-30.08,;-2.99,-27.77,;-1.65,-28.54,;-1.66,-30.08,;-.33,-30.85,;.93,-29.86,;2.16,-30.85,;1.68,-32.32,;2.44,-33.63,;1.68,-34.96,;.14,-34.96,;-.62,-33.63,;.15,-32.31,;-.32,-27.77,;-.32,-26.23,;1.01,-28.54,;2.35,-27.77,;2.35,-26.23,;3.68,-25.47,;5.02,-26.24,;3.68,-23.93,;3.67,-28.55,;3.67,-30.09,;5.01,-27.78,;6.34,-28.55,;6.34,-30.09,;7.68,-30.86,;7.68,-27.78,;7.68,-26.24,;9.01,-28.55,;10.34,-27.78,;10.35,-26.24,;11.68,-25.48,;13.01,-26.24,;14.35,-25.48,;14.35,-23.93,;13.01,-23.16,;11.68,-23.94,;11.68,-28.56,;11.68,-30.1,;13.01,-27.79,;14.35,-28.55,;15.68,-27.78,;15.68,-26.24,;17.01,-28.55,;18.35,-27.78,;18.35,-26.24,;19.68,-25.48,;19.68,-23.94,;21.02,-26.25,;19.68,-28.56,;19.68,-30.1,;21.02,-27.79,;22.35,-28.56,;22.35,-30.1,;23.68,-30.87,;23.68,-32.41,;25.01,-33.18,;25.01,-34.72,;26.34,-35.49,;23.68,-35.49,;23.69,-27.79,;23.69,-26.25,;25.02,-28.56,;26.35,-27.79,;26.35,-26.25,;27.69,-25.48,;27.68,-23.95,;26.34,-23.19,;29.01,-23.17,;27.69,-28.57,;29.02,-27.8,;27.68,-30.11,)|
Show InChI InChI=1S/C74H106N22O19/c1-37(2)26-44(75)73(115)96-25-11-17-56(96)72(114)94-54(33-60(79)102)69(111)90-50(29-40-18-20-42(98)21-19-40)66(108)92-52(31-58(77)100)68(110)91-51(30-41-34-84-45-15-9-8-14-43(41)45)67(109)93-53(32-59(78)101)70(112)95-55(36-97)71(113)89-49(28-39-12-6-5-7-13-39)63(105)85-35-61(103)86-48(27-38(3)4)65(107)88-47(16-10-24-83-74(81)82)64(106)87-46(62(80)104)22-23-57(76)99/h5-9,12-15,18-21,34,37-38,44,46-56,84,97-98H,10-11,16-17,22-33,35-36,75H2,1-4H3,(H2,76,99)(H2,77,100)(H2,78,101)(H2,79,102)(H2,80,104)(H,85,105)(H,86,103)(H,87,106)(H,88,107)(H,89,113)(H,90,111)(H,91,110)(H,92,108)(H,93,109)(H,94,114)(H,95,112)(H4,81,82,83)/t44-,46-,47-,48-,49-,50-,51-,52-,53-,54-,55-,56-/m0/s1
Reactome pathway
495n/an/an/an/an/an/an/an/a
University of Minnesota Health Science Center
Curated by ChEMBL
Assay Description
Displacement of [125]metastin from metastin receptor
J Med Chem 50: 462-71 (2007)
Article DOI: 10.1021/jm0609824
BindingDB Entry DOI: 10.7270/Q2HT2P0K
G-protein Coupled Receptor 54
(Homo sapiens (Human))
BDBM50203784
((2S)-2-[(2S)-2-[(2S)-2-{2-[(2S)-2-[(2S)-2-[(2S)-2-...)
Show SMILES CC(C)C[C@H](N)C(=O)N1CCC[C@H]1C(=O)N[C@@H](CC(N)=O)C(=O)N[C@@H](Cc1ccc(O)cc1)C(=O)N[C@@H](CC(N)=O)C(=O)N[C@@H](Cc1c[nH]c2ccccc12)C(=O)N[C@@H](CC(N)=O)C(=O)N[C@@H](CO)C(=O)N[C@@H](Cc1ccccc1)C(=O)NCC(=O)N[C@@H](CC(C)C)C(=O)N[C@@H](CCCN=C(N)N)C(=O)N[C@@H](CCC(N)=O)C(N)=O |wU:58.61,4.4,72.75,87.91,36.37,12.13,106.110,wD:66.69,24.24,95.99,16.16,44.45,(-20.28,-19.15,;-20.26,-20.69,;-21.58,-21.47,;-18.91,-21.43,;-18.9,-22.99,;-20.24,-23.76,;-17.57,-23.76,;-17.57,-25.3,;-16.25,-22.99,;-15.77,-21.53,;-14.22,-21.54,;-13.74,-22.99,;-14.99,-23.9,;-14.99,-25.44,;-16.34,-26.21,;-13.67,-26.22,;-13.67,-27.76,;-15,-28.52,;-15,-30.06,;-13.68,-30.84,;-16.33,-30.83,;-12.34,-28.53,;-12.34,-30.07,;-10.99,-27.76,;-9.66,-28.53,;-9.66,-30.07,;-8.33,-30.84,;-8.33,-32.38,;-7.01,-33.15,;-5.66,-32.38,;-4.33,-33.15,;-5.67,-30.83,;-6.99,-30.07,;-8.32,-27.76,;-8.32,-26.22,;-6.99,-28.53,;-5.66,-27.77,;-5.66,-26.23,;-4.32,-25.46,;-2.99,-26.23,;-4.32,-23.92,;-4.32,-28.54,;-4.33,-30.08,;-2.99,-27.77,;-1.65,-28.54,;-1.66,-30.08,;-.33,-30.85,;.93,-29.86,;2.16,-30.85,;1.68,-32.32,;2.44,-33.63,;1.68,-34.96,;.14,-34.96,;-.62,-33.63,;.15,-32.31,;-.32,-27.77,;-.32,-26.23,;1.01,-28.54,;2.35,-27.77,;2.35,-26.23,;3.68,-25.47,;5.02,-26.24,;3.68,-23.93,;3.67,-28.55,;3.67,-30.09,;5.01,-27.78,;6.34,-28.55,;6.34,-30.09,;7.68,-30.86,;7.68,-27.78,;7.68,-26.24,;9.01,-28.55,;10.34,-27.78,;10.35,-26.24,;11.68,-25.48,;13.01,-26.24,;14.35,-25.48,;14.35,-23.93,;13.01,-23.16,;11.68,-23.94,;11.68,-28.56,;11.68,-30.1,;13.01,-27.79,;14.35,-28.55,;15.68,-27.78,;15.68,-26.24,;17.01,-28.55,;18.35,-27.78,;18.35,-26.24,;19.68,-25.48,;19.68,-23.94,;21.02,-26.25,;19.68,-28.56,;19.68,-30.1,;21.02,-27.79,;22.35,-28.56,;22.35,-30.1,;23.68,-30.87,;23.68,-32.41,;25.01,-33.18,;25.01,-34.72,;26.34,-35.49,;23.68,-35.49,;23.69,-27.79,;23.69,-26.25,;25.02,-28.56,;26.35,-27.79,;26.35,-26.25,;27.69,-25.48,;27.68,-23.95,;26.34,-23.19,;29.01,-23.17,;27.69,-28.57,;29.02,-27.8,;27.68,-30.11,)|
Show InChI InChI=1S/C74H106N22O19/c1-37(2)26-44(75)73(115)96-25-11-17-56(96)72(114)94-54(33-60(79)102)69(111)90-50(29-40-18-20-42(98)21-19-40)66(108)92-52(31-58(77)100)68(110)91-51(30-41-34-84-45-15-9-8-14-43(41)45)67(109)93-53(32-59(78)101)70(112)95-55(36-97)71(113)89-49(28-39-12-6-5-7-13-39)63(105)85-35-61(103)86-48(27-38(3)4)65(107)88-47(16-10-24-83-74(81)82)64(106)87-46(62(80)104)22-23-57(76)99/h5-9,12-15,18-21,34,37-38,44,46-56,84,97-98H,10-11,16-17,22-33,35-36,75H2,1-4H3,(H2,76,99)(H2,77,100)(H2,78,101)(H2,79,102)(H2,80,104)(H,85,105)(H,86,103)(H,87,106)(H,88,107)(H,89,113)(H,90,111)(H,91,110)(H,92,108)(H,93,109)(H,94,114)(H,95,112)(H4,81,82,83)/t44-,46-,47-,48-,49-,50-,51-,52-,53-,54-,55-,56-/m0/s1
Reactome pathway
n/an/an/an/a 2.10E+3n/an/an/an/a
University of Minnesota Health Science Center
Curated by ChEMBL
Assay Description
Activity at metastin receptor expressed in HEK293 cells by measuring calcium release
J Med Chem 50: 462-71 (2007)
Article DOI: 10.1021/jm0609824
BindingDB Entry DOI: 10.7270/Q2HT2P0K