BDBM50203795 (2S)-2-{[(2S)-1-[(2S)-2-amino-4-methylpentanoyl]pyrrolidin-2-yl]formamido}-N-[(1S)-1-{[(1S)-1-{[(1S)-1-{[(1S)-1-{[(1S)-1-{[(1S)-1-[({[(1S)-1-{[(1S)-4-carbamimidamido-1-{[(1S)-1-carbamoyl-2-phenylethyl]carbamoyl}butyl]carbamoyl}-3-methylbutyl]carbamoyl}methyl)carbamoyl]-3-methylbutyl]carbamoyl}-2-hydroxyethyl]carbamoyl}-2-carbamoylethyl]carbamoyl}-2-(1H-indol-3-yl)ethyl]carbamoyl}-2-carbamoylethyl]carbamoyl}-2-(4-hydroxyphenyl)ethyl]butanediamide::CHEMBL441935
SMILES: CC(C)C[C@H](N)C(=O)N1CCC[C@H]1C(=O)N[C@@H](CC(N)=O)C(=O)N[C@@H](Cc1ccc(O)cc1)C(=O)N[C@@H](CC(N)=O)C(=O)N[C@@H](Cc1c[nH]c2ccccc12)C(=O)N[C@@H](CC(N)=O)C(=O)N[C@@H](CO)C(=O)N[C@@H](CC(C)C)C(=O)NCC(=O)N[C@@H](CC(C)C)C(=O)N[C@@H](CCCN=C(N)N)C(=O)N[C@@H](Cc1ccccc1)C(N)=O
InChI Key: InChIKey=RBJGQTLQBRDUOZ-IOCMDPNHSA-N
Data: 1 KI  1 EC50
Activity Spreadsheet -- Enzyme Inhibition Constant Data from BindingDB
Found 2 hits for monomerid = 50203795
Trg + Lig
Ki
nM
ΔG°
kcal/mole
IC50
nM
Kd
nM
EC50/IC50
nM
koff
s-1
kon
M-1s-1
pHTemp
°C
G-protein Coupled Receptor 54
(Homo sapiens (Human))
BDBM50203795
((2S)-2-{[(2S)-1-[(2S)-2-amino-4-methylpentanoyl]py...)
Show SMILES CC(C)C[C@H](N)C(=O)N1CCC[C@H]1C(=O)N[C@@H](CC(N)=O)C(=O)N[C@@H](Cc1ccc(O)cc1)C(=O)N[C@@H](CC(N)=O)C(=O)N[C@@H](Cc1c[nH]c2ccccc12)C(=O)N[C@@H](CC(N)=O)C(=O)N[C@@H](CO)C(=O)N[C@@H](CC(C)C)C(=O)NCC(=O)N[C@@H](CC(C)C)C(=O)N[C@@H](CCCN=C(N)N)C(=O)N[C@@H](Cc1ccccc1)C(N)=O |wU:58.61,4.4,72.75,84.87,36.37,12.13,103.106,wD:66.69,24.24,92.95,16.16,44.45,(-5.72,-19.26,;-5.69,-20.8,;-7.02,-21.58,;-4.35,-21.54,;-4.34,-23.1,;-5.68,-23.87,;-3.01,-23.87,;-3.01,-25.41,;-1.68,-23.11,;-1.2,-21.65,;.34,-21.65,;.82,-23.1,;-.43,-24.02,;-.43,-25.56,;-1.77,-26.32,;.9,-26.33,;.89,-27.87,;-.44,-28.64,;-.44,-30.18,;.89,-30.95,;-1.78,-30.94,;2.22,-28.64,;2.22,-30.18,;3.56,-27.87,;4.89,-28.64,;4.89,-30.18,;6.23,-30.95,;6.22,-32.49,;7.55,-33.26,;8.89,-32.49,;10.22,-33.26,;8.88,-30.94,;7.56,-30.18,;6.23,-27.87,;6.23,-26.33,;7.56,-28.64,;8.89,-27.88,;8.89,-26.34,;10.23,-25.57,;11.56,-26.34,;10.23,-24.03,;10.23,-28.65,;10.23,-30.19,;11.56,-27.88,;12.9,-28.65,;12.9,-30.19,;14.22,-30.96,;15.48,-29.97,;16.71,-30.96,;16.24,-32.43,;17,-33.74,;16.24,-35.07,;14.7,-35.07,;13.94,-33.74,;14.71,-32.42,;14.23,-27.88,;14.23,-26.34,;15.57,-28.65,;16.9,-27.89,;16.9,-26.35,;18.23,-25.58,;19.57,-26.35,;18.23,-24.04,;18.23,-28.66,;18.23,-30.2,;19.57,-27.89,;20.9,-28.66,;20.89,-30.2,;22.23,-30.97,;22.24,-27.89,;22.24,-26.35,;23.57,-28.66,;24.9,-27.9,;24.9,-26.36,;26.24,-25.59,;27.56,-26.36,;26.23,-24.05,;26.23,-28.67,;26.23,-30.21,;27.57,-27.9,;28.9,-28.66,;30.23,-27.89,;30.24,-26.35,;31.56,-28.66,;32.9,-27.9,;32.9,-26.36,;34.24,-25.59,;34.24,-24.05,;35.57,-26.36,;34.23,-28.67,;34.23,-30.21,;35.57,-27.9,;36.9,-28.67,;36.9,-30.21,;38.24,-30.98,;38.24,-32.52,;39.56,-33.29,;39.56,-34.83,;40.89,-35.61,;38.23,-35.6,;38.24,-27.9,;38.24,-26.36,;39.57,-28.67,;40.9,-27.91,;40.9,-26.37,;42.24,-25.6,;43.57,-26.38,;44.91,-25.61,;44.91,-24.07,;43.56,-23.3,;42.24,-24.07,;42.24,-28.68,;43.57,-27.91,;42.24,-30.22,)|
Show InChI InChI=1S/C75H109N21O18/c1-38(2)26-46(76)74(114)96-25-13-19-58(96)73(113)94-56(34-61(79)101)70(110)90-52(30-42-20-22-44(98)23-21-42)67(107)92-54(32-59(77)99)69(109)91-53(31-43-35-84-47-17-11-10-16-45(43)47)68(108)93-55(33-60(78)100)71(111)95-57(37-97)72(112)89-50(27-39(3)4)64(104)85-36-62(102)86-51(28-40(5)6)66(106)87-48(18-12-24-83-75(81)82)65(105)88-49(63(80)103)29-41-14-8-7-9-15-41/h7-11,14-17,20-23,35,38-40,46,48-58,84,97-98H,12-13,18-19,24-34,36-37,76H2,1-6H3,(H2,77,99)(H2,78,100)(H2,79,101)(H2,80,103)(H,85,104)(H,86,102)(H,87,106)(H,88,105)(H,89,112)(H,90,110)(H,91,109)(H,92,107)(H,93,108)(H,94,113)(H,95,111)(H4,81,82,83)/t46-,48-,49-,50-,51-,52-,53-,54-,55-,56-,57-,58-/m0/s1
Reactome pathway
142n/an/an/an/an/an/an/an/a
University of Minnesota Health Science Center
Curated by ChEMBL
Assay Description
Displacement of [125]metastin from metastin receptor
J Med Chem 50: 462-71 (2007)
Article DOI: 10.1021/jm0609824
BindingDB Entry DOI: 10.7270/Q2HT2P0K
G-protein Coupled Receptor 54
(Homo sapiens (Human))
BDBM50203795
((2S)-2-{[(2S)-1-[(2S)-2-amino-4-methylpentanoyl]py...)
Show SMILES CC(C)C[C@H](N)C(=O)N1CCC[C@H]1C(=O)N[C@@H](CC(N)=O)C(=O)N[C@@H](Cc1ccc(O)cc1)C(=O)N[C@@H](CC(N)=O)C(=O)N[C@@H](Cc1c[nH]c2ccccc12)C(=O)N[C@@H](CC(N)=O)C(=O)N[C@@H](CO)C(=O)N[C@@H](CC(C)C)C(=O)NCC(=O)N[C@@H](CC(C)C)C(=O)N[C@@H](CCCN=C(N)N)C(=O)N[C@@H](Cc1ccccc1)C(N)=O |wU:58.61,4.4,72.75,84.87,36.37,12.13,103.106,wD:66.69,24.24,92.95,16.16,44.45,(-5.72,-19.26,;-5.69,-20.8,;-7.02,-21.58,;-4.35,-21.54,;-4.34,-23.1,;-5.68,-23.87,;-3.01,-23.87,;-3.01,-25.41,;-1.68,-23.11,;-1.2,-21.65,;.34,-21.65,;.82,-23.1,;-.43,-24.02,;-.43,-25.56,;-1.77,-26.32,;.9,-26.33,;.89,-27.87,;-.44,-28.64,;-.44,-30.18,;.89,-30.95,;-1.78,-30.94,;2.22,-28.64,;2.22,-30.18,;3.56,-27.87,;4.89,-28.64,;4.89,-30.18,;6.23,-30.95,;6.22,-32.49,;7.55,-33.26,;8.89,-32.49,;10.22,-33.26,;8.88,-30.94,;7.56,-30.18,;6.23,-27.87,;6.23,-26.33,;7.56,-28.64,;8.89,-27.88,;8.89,-26.34,;10.23,-25.57,;11.56,-26.34,;10.23,-24.03,;10.23,-28.65,;10.23,-30.19,;11.56,-27.88,;12.9,-28.65,;12.9,-30.19,;14.22,-30.96,;15.48,-29.97,;16.71,-30.96,;16.24,-32.43,;17,-33.74,;16.24,-35.07,;14.7,-35.07,;13.94,-33.74,;14.71,-32.42,;14.23,-27.88,;14.23,-26.34,;15.57,-28.65,;16.9,-27.89,;16.9,-26.35,;18.23,-25.58,;19.57,-26.35,;18.23,-24.04,;18.23,-28.66,;18.23,-30.2,;19.57,-27.89,;20.9,-28.66,;20.89,-30.2,;22.23,-30.97,;22.24,-27.89,;22.24,-26.35,;23.57,-28.66,;24.9,-27.9,;24.9,-26.36,;26.24,-25.59,;27.56,-26.36,;26.23,-24.05,;26.23,-28.67,;26.23,-30.21,;27.57,-27.9,;28.9,-28.66,;30.23,-27.89,;30.24,-26.35,;31.56,-28.66,;32.9,-27.9,;32.9,-26.36,;34.24,-25.59,;34.24,-24.05,;35.57,-26.36,;34.23,-28.67,;34.23,-30.21,;35.57,-27.9,;36.9,-28.67,;36.9,-30.21,;38.24,-30.98,;38.24,-32.52,;39.56,-33.29,;39.56,-34.83,;40.89,-35.61,;38.23,-35.6,;38.24,-27.9,;38.24,-26.36,;39.57,-28.67,;40.9,-27.91,;40.9,-26.37,;42.24,-25.6,;43.57,-26.38,;44.91,-25.61,;44.91,-24.07,;43.56,-23.3,;42.24,-24.07,;42.24,-28.68,;43.57,-27.91,;42.24,-30.22,)|
Show InChI InChI=1S/C75H109N21O18/c1-38(2)26-46(76)74(114)96-25-13-19-58(96)73(113)94-56(34-61(79)101)70(110)90-52(30-42-20-22-44(98)23-21-42)67(107)92-54(32-59(77)99)69(109)91-53(31-43-35-84-47-17-11-10-16-45(43)47)68(108)93-55(33-60(78)100)71(111)95-57(37-97)72(112)89-50(27-39(3)4)64(104)85-36-62(102)86-51(28-40(5)6)66(106)87-48(18-12-24-83-75(81)82)65(105)88-49(63(80)103)29-41-14-8-7-9-15-41/h7-11,14-17,20-23,35,38-40,46,48-58,84,97-98H,12-13,18-19,24-34,36-37,76H2,1-6H3,(H2,77,99)(H2,78,100)(H2,79,101)(H2,80,103)(H,85,104)(H,86,102)(H,87,106)(H,88,105)(H,89,112)(H,90,110)(H,91,109)(H,92,107)(H,93,108)(H,94,113)(H,95,111)(H4,81,82,83)/t46-,48-,49-,50-,51-,52-,53-,54-,55-,56-,57-,58-/m0/s1
Reactome pathway
n/an/an/an/a 290n/an/an/an/a
University of Minnesota Health Science Center
Curated by ChEMBL
Assay Description
Activity at metastin receptor expressed in HEK293 cells by measuring calcium release
J Med Chem 50: 462-71 (2007)
Article DOI: 10.1021/jm0609824
BindingDB Entry DOI: 10.7270/Q2HT2P0K