BDBM50203799 (2S)-2-{[(2S)-1-[(2S)-2-amino-4-methylpentanoyl]pyrrolidin-2-yl]formamido}-N-[(1S)-1-{[(1S)-1-{[(1S)-1-{[(1S)-1-{[(1S)-1-{[(1S)-1-[({[(1S,2S)-1-{[(1S)-4-carbamimidamido-1-{[(1S)-1-carbamoyl-2-phenylethyl]carbamoyl}butyl]carbamoyl}-2-methylbutyl]carbamoyl}methyl)carbamoyl]-2-phenylethyl]carbamoyl}-2-hydroxyethyl]carbamoyl}-2-carbamoylethyl]carbamoyl}-2-(1H-indol-3-yl)ethyl]carbamoyl}-2-carbamoylethyl]carbamoyl}-2-(4-hydroxyphenyl)ethyl]butanediamide::CHEMBL439094
SMILES: CC[C@H](C)[C@H](NC(=O)CNC(=O)[C@H](Cc1ccccc1)NC(=O)[C@H](CO)NC(=O)[C@H](CC(N)=O)NC(=O)[C@H](Cc1c[nH]c2ccccc12)NC(=O)[C@H](CC(N)=O)NC(=O)[C@H](Cc1ccc(O)cc1)NC(=O)[C@H](CC(N)=O)NC(=O)[C@@H]1CCCN1C(=O)[C@@H](N)CC(C)C)C(=O)N[C@@H](CCCN=C(N)N)C(=O)N[C@@H](Cc1ccccc1)C(N)=O
InChI Key: InChIKey=BYGIEEDZRVUPEC-URDDEDKTSA-N
Data: 1 KI  1 EC50
Activity Spreadsheet -- Enzyme Inhibition Constant Data from BindingDB
Found 2 hits for monomerid = 50203799
Trg + Lig
Ki
nM
ΔG°
kcal/mole
IC50
nM
Kd
nM
EC50/IC50
nM
koff
s-1
kon
M-1s-1
pHTemp
°C
G-protein Coupled Receptor 54
(Homo sapiens (Human))
BDBM50203799
((2S)-2-{[(2S)-1-[(2S)-2-amino-4-methylpentanoyl]py...)
Show SMILES CC[C@H](C)[C@H](NC(=O)CNC(=O)[C@H](Cc1ccccc1)NC(=O)[C@H](CO)NC(=O)[C@H](CC(N)=O)NC(=O)[C@H](Cc1c[nH]c2ccccc12)NC(=O)[C@H](CC(N)=O)NC(=O)[C@H](Cc1ccc(O)cc1)NC(=O)[C@H](CC(N)=O)NC(=O)[C@@H]1CCCN1C(=O)[C@@H](N)CC(C)C)C(=O)N[C@@H](CCCN=C(N)N)C(=O)N[C@@H](Cc1ccccc1)C(N)=O |wU:29.34,86.91,12.20,4.4,51.58,79.82,106.110,2.2,wD:23.26,59.71,95.99,71.79,37.50,(27.31,-26.54,;25.97,-25.77,;24.64,-26.54,;23.31,-25.76,;24.64,-28.08,;23.3,-28.84,;21.97,-28.07,;21.97,-26.53,;20.64,-28.84,;19.3,-28.08,;17.97,-28.85,;17.97,-30.39,;16.63,-28.07,;16.63,-26.53,;17.97,-25.77,;19.3,-26.53,;20.64,-25.77,;20.64,-24.23,;19.29,-23.45,;17.97,-24.23,;15.3,-28.84,;13.97,-28.07,;13.97,-26.53,;12.63,-28.84,;12.63,-30.38,;13.97,-31.15,;11.3,-28.07,;9.96,-28.84,;9.96,-30.38,;8.63,-28.07,;8.64,-26.53,;9.97,-25.76,;11.3,-26.53,;9.97,-24.22,;7.3,-28.83,;5.96,-28.06,;5.97,-26.52,;4.63,-28.83,;4.63,-30.37,;5.95,-31.14,;7.22,-30.15,;8.45,-31.14,;7.97,-32.61,;8.73,-33.92,;7.97,-35.25,;6.43,-35.25,;5.67,-33.92,;6.44,-32.6,;3.3,-28.06,;1.96,-28.83,;1.96,-30.37,;.63,-28.06,;.63,-26.52,;1.97,-25.75,;3.3,-26.52,;1.97,-24.21,;-.7,-28.82,;-2.03,-28.05,;-2.03,-26.51,;-3.37,-28.82,;-3.38,-30.36,;-2.04,-31.13,;-2.05,-32.67,;-.72,-33.44,;.62,-32.67,;1.95,-33.44,;.62,-31.12,;-.71,-30.36,;-4.7,-28.05,;-6.04,-28.82,;-6.04,-30.36,;-7.37,-28.05,;-8.7,-28.82,;-8.7,-30.36,;-7.38,-31.13,;-10.04,-31.12,;-7.37,-26.51,;-8.7,-25.74,;-10.04,-26.5,;-8.7,-24.2,;-7.45,-23.28,;-7.93,-21.83,;-9.46,-21.83,;-9.94,-23.29,;-11.27,-24.05,;-11.27,-25.59,;-12.61,-23.28,;-13.95,-24.05,;-12.62,-21.72,;-13.97,-20.98,;-13.99,-19.44,;-15.3,-21.76,;25.97,-28.85,;25.97,-30.39,;27.31,-28.08,;28.64,-28.85,;28.63,-30.39,;29.97,-31.16,;29.97,-32.7,;31.3,-33.47,;31.3,-35.01,;32.63,-35.79,;29.97,-35.78,;29.98,-28.08,;29.98,-26.54,;31.31,-28.85,;32.64,-28.09,;32.64,-26.55,;33.98,-25.78,;35.3,-26.56,;36.64,-25.79,;36.64,-24.25,;35.3,-23.48,;33.97,-24.25,;33.97,-28.86,;35.31,-28.09,;33.97,-30.4,)|
Show InChI InChI=1S/C78H107N21O18/c1-5-42(4)65(76(116)89-51(22-14-28-86-78(84)85)68(108)90-52(66(83)106)31-43-16-8-6-9-17-43)98-64(105)39-88-67(107)53(32-44-18-10-7-11-19-44)91-74(114)59(40-100)97-73(113)57(36-62(81)103)95-70(110)55(34-46-38-87-50-21-13-12-20-48(46)50)93-71(111)56(35-61(80)102)94-69(109)54(33-45-24-26-47(101)27-25-45)92-72(112)58(37-63(82)104)96-75(115)60-23-15-29-99(60)77(117)49(79)30-41(2)3/h6-13,16-21,24-27,38,41-42,49,51-60,65,87,100-101H,5,14-15,22-23,28-37,39-40,79H2,1-4H3,(H2,80,102)(H2,81,103)(H2,82,104)(H2,83,106)(H,88,107)(H,89,116)(H,90,108)(H,91,114)(H,92,112)(H,93,111)(H,94,109)(H,95,110)(H,96,115)(H,97,113)(H,98,105)(H4,84,85,86)/t42-,49-,51-,52-,53-,54-,55-,56-,57-,58-,59-,60-,65-/m0/s1
Reactome pathway
51.5n/an/an/an/an/an/an/an/a
University of Minnesota Health Science Center
Curated by ChEMBL
Assay Description
Displacement of [125]metastin from metastin receptor
J Med Chem 50: 462-71 (2007)
Article DOI: 10.1021/jm0609824
BindingDB Entry DOI: 10.7270/Q2HT2P0K
G-protein Coupled Receptor 54
(Homo sapiens (Human))
BDBM50203799
((2S)-2-{[(2S)-1-[(2S)-2-amino-4-methylpentanoyl]py...)
Show SMILES CC[C@H](C)[C@H](NC(=O)CNC(=O)[C@H](Cc1ccccc1)NC(=O)[C@H](CO)NC(=O)[C@H](CC(N)=O)NC(=O)[C@H](Cc1c[nH]c2ccccc12)NC(=O)[C@H](CC(N)=O)NC(=O)[C@H](Cc1ccc(O)cc1)NC(=O)[C@H](CC(N)=O)NC(=O)[C@@H]1CCCN1C(=O)[C@@H](N)CC(C)C)C(=O)N[C@@H](CCCN=C(N)N)C(=O)N[C@@H](Cc1ccccc1)C(N)=O |wU:29.34,86.91,12.20,4.4,51.58,79.82,106.110,2.2,wD:23.26,59.71,95.99,71.79,37.50,(27.31,-26.54,;25.97,-25.77,;24.64,-26.54,;23.31,-25.76,;24.64,-28.08,;23.3,-28.84,;21.97,-28.07,;21.97,-26.53,;20.64,-28.84,;19.3,-28.08,;17.97,-28.85,;17.97,-30.39,;16.63,-28.07,;16.63,-26.53,;17.97,-25.77,;19.3,-26.53,;20.64,-25.77,;20.64,-24.23,;19.29,-23.45,;17.97,-24.23,;15.3,-28.84,;13.97,-28.07,;13.97,-26.53,;12.63,-28.84,;12.63,-30.38,;13.97,-31.15,;11.3,-28.07,;9.96,-28.84,;9.96,-30.38,;8.63,-28.07,;8.64,-26.53,;9.97,-25.76,;11.3,-26.53,;9.97,-24.22,;7.3,-28.83,;5.96,-28.06,;5.97,-26.52,;4.63,-28.83,;4.63,-30.37,;5.95,-31.14,;7.22,-30.15,;8.45,-31.14,;7.97,-32.61,;8.73,-33.92,;7.97,-35.25,;6.43,-35.25,;5.67,-33.92,;6.44,-32.6,;3.3,-28.06,;1.96,-28.83,;1.96,-30.37,;.63,-28.06,;.63,-26.52,;1.97,-25.75,;3.3,-26.52,;1.97,-24.21,;-.7,-28.82,;-2.03,-28.05,;-2.03,-26.51,;-3.37,-28.82,;-3.38,-30.36,;-2.04,-31.13,;-2.05,-32.67,;-.72,-33.44,;.62,-32.67,;1.95,-33.44,;.62,-31.12,;-.71,-30.36,;-4.7,-28.05,;-6.04,-28.82,;-6.04,-30.36,;-7.37,-28.05,;-8.7,-28.82,;-8.7,-30.36,;-7.38,-31.13,;-10.04,-31.12,;-7.37,-26.51,;-8.7,-25.74,;-10.04,-26.5,;-8.7,-24.2,;-7.45,-23.28,;-7.93,-21.83,;-9.46,-21.83,;-9.94,-23.29,;-11.27,-24.05,;-11.27,-25.59,;-12.61,-23.28,;-13.95,-24.05,;-12.62,-21.72,;-13.97,-20.98,;-13.99,-19.44,;-15.3,-21.76,;25.97,-28.85,;25.97,-30.39,;27.31,-28.08,;28.64,-28.85,;28.63,-30.39,;29.97,-31.16,;29.97,-32.7,;31.3,-33.47,;31.3,-35.01,;32.63,-35.79,;29.97,-35.78,;29.98,-28.08,;29.98,-26.54,;31.31,-28.85,;32.64,-28.09,;32.64,-26.55,;33.98,-25.78,;35.3,-26.56,;36.64,-25.79,;36.64,-24.25,;35.3,-23.48,;33.97,-24.25,;33.97,-28.86,;35.31,-28.09,;33.97,-30.4,)|
Show InChI InChI=1S/C78H107N21O18/c1-5-42(4)65(76(116)89-51(22-14-28-86-78(84)85)68(108)90-52(66(83)106)31-43-16-8-6-9-17-43)98-64(105)39-88-67(107)53(32-44-18-10-7-11-19-44)91-74(114)59(40-100)97-73(113)57(36-62(81)103)95-70(110)55(34-46-38-87-50-21-13-12-20-48(46)50)93-71(111)56(35-61(80)102)94-69(109)54(33-45-24-26-47(101)27-25-45)92-72(112)58(37-63(82)104)96-75(115)60-23-15-29-99(60)77(117)49(79)30-41(2)3/h6-13,16-21,24-27,38,41-42,49,51-60,65,87,100-101H,5,14-15,22-23,28-37,39-40,79H2,1-4H3,(H2,80,102)(H2,81,103)(H2,82,104)(H2,83,106)(H,88,107)(H,89,116)(H,90,108)(H,91,114)(H,92,112)(H,93,111)(H,94,109)(H,95,110)(H,96,115)(H,97,113)(H,98,105)(H4,84,85,86)/t42-,49-,51-,52-,53-,54-,55-,56-,57-,58-,59-,60-,65-/m0/s1
Reactome pathway
n/an/an/an/a 110n/an/an/an/a
University of Minnesota Health Science Center
Curated by ChEMBL
Assay Description
Activity at metastin receptor expressed in HEK293 cells by measuring calcium release
J Med Chem 50: 462-71 (2007)
Article DOI: 10.1021/jm0609824
BindingDB Entry DOI: 10.7270/Q2HT2P0K