BDBM50204181 5-(4-chlorophenyl)-6-(2,4-dichlorophenyl)-2-(piperidin-1-yl)nicotinonitrile::CHEMBL248109
SMILES: Clc1ccc(cc1)-c1cc(C#N)c(nc1-c1ccc(Cl)cc1Cl)N1CCCCC1
InChI Key: InChIKey=MEBKWTDHNAIEFS-UHFFFAOYSA-N
Data: 2 IC50
Activity Spreadsheet -- Enzyme Inhibition Constant Data from BindingDB
Found 2 hits for monomerid = 50204181
Trg + Lig
Ki
nM
ΔG°
kcal/mole
IC50
nM
Kd
nM
EC50/IC50
nM
koff
s-1
kon
M-1s-1
pHTemp
°C
Cannabinoid receptor 2
(Homo sapiens (Human))
BDBM50204181
(5-(4-chlorophenyl)-6-(2,4-dichlorophenyl)-2-(piper...)
Show SMILES Clc1ccc(cc1)-c1cc(C#N)c(nc1-c1ccc(Cl)cc1Cl)N1CCCCC1
Show InChI InChI=1S/C23H18Cl3N3/c24-17-6-4-15(5-7-17)20-12-16(14-27)23(29-10-2-1-3-11-29)28-22(20)19-9-8-18(25)13-21(19)26/h4-9,12-13H,1-3,10-11H2
Reactome pathway
n/an/a 4.00E+3n/an/an/an/an/an/a
Merck Research Laboratories
Curated by ChEMBL
Assay Description
Binding affinity at CB2 receptor
Bioorg Med Chem Lett 17: 2031-5 (2007)
Article DOI: 10.1016/j.bmcl.2007.01.005
BindingDB Entry DOI: 10.7270/Q27944BJ
Cannabinoid receptor 1
(Homo sapiens (Human))
BDBM50204181
(5-(4-chlorophenyl)-6-(2,4-dichlorophenyl)-2-(piper...)
Show SMILES Clc1ccc(cc1)-c1cc(C#N)c(nc1-c1ccc(Cl)cc1Cl)N1CCCCC1
Show InChI InChI=1S/C23H18Cl3N3/c24-17-6-4-15(5-7-17)20-12-16(14-27)23(29-10-2-1-3-11-29)28-22(20)19-9-8-18(25)13-21(19)26/h4-9,12-13H,1-3,10-11H2
NCI pathway
Reactome pathway
n/an/a 19n/an/an/an/an/an/a
Merck Research Laboratories
Curated by ChEMBL
Assay Description
Binding affinity at CB1 receptor
Bioorg Med Chem Lett 17: 2031-5 (2007)
Article DOI: 10.1016/j.bmcl.2007.01.005
BindingDB Entry DOI: 10.7270/Q27944BJ