BDBM50204194 5-(4-chlorophenyl)-6-(2,4-dichlorophenyl)-2-(3,4-difluorophenoxy)-N',N'-dimethylnicotinohydrazide::CHEMBL247308
SMILES: CN(C)NC(=O)c1cc(-c2ccc(Cl)cc2)c(nc1Oc1ccc(F)c(F)c1)-c1ccc(Cl)cc1Cl
InChI Key: InChIKey=GJYAHGCCGZMMCK-UHFFFAOYSA-N
Data: 2 IC50
Activity Spreadsheet -- Enzyme Inhibition Constant Data from BindingDB
Found 2 hits for monomerid = 50204194
Trg + Lig
Ki
nM
ΔG°
kcal/mole
IC50
nM
Kd
nM
EC50/IC50
nM
koff
s-1
kon
M-1s-1
pHTemp
°C
Cannabinoid receptor 1
(Homo sapiens (Human))
BDBM50204194
(5-(4-chlorophenyl)-6-(2,4-dichlorophenyl)-2-(3,4-d...)
Show SMILES CN(C)NC(=O)c1cc(-c2ccc(Cl)cc2)c(nc1Oc1ccc(F)c(F)c1)-c1ccc(Cl)cc1Cl
Show InChI InChI=1S/C26H18Cl3F2N3O2/c1-34(2)33-25(35)20-13-19(14-3-5-15(27)6-4-14)24(18-9-7-16(28)11-21(18)29)32-26(20)36-17-8-10-22(30)23(31)12-17/h3-13H,1-2H3,(H,33,35)
NCI pathway
Reactome pathway
n/an/a 5.60n/an/an/an/an/an/a
Merck Research Laboratories
Curated by ChEMBL
Assay Description
Binding affinity at CB1 receptor
Bioorg Med Chem Lett 17: 2031-5 (2007)
Article DOI: 10.1016/j.bmcl.2007.01.005
BindingDB Entry DOI: 10.7270/Q27944BJ
Cannabinoid receptor 2
(Homo sapiens (Human))
BDBM50204194
(5-(4-chlorophenyl)-6-(2,4-dichlorophenyl)-2-(3,4-d...)
Show SMILES CN(C)NC(=O)c1cc(-c2ccc(Cl)cc2)c(nc1Oc1ccc(F)c(F)c1)-c1ccc(Cl)cc1Cl
Show InChI InChI=1S/C26H18Cl3F2N3O2/c1-34(2)33-25(35)20-13-19(14-3-5-15(27)6-4-14)24(18-9-7-16(28)11-21(18)29)32-26(20)36-17-8-10-22(30)23(31)12-17/h3-13H,1-2H3,(H,33,35)
Reactome pathway
n/an/a 1.80E+3n/an/an/an/an/an/a
Merck Research Laboratories
Curated by ChEMBL
Assay Description
Binding affinity at CB2 receptor
Bioorg Med Chem Lett 17: 2031-5 (2007)
Article DOI: 10.1016/j.bmcl.2007.01.005
BindingDB Entry DOI: 10.7270/Q27944BJ