BDBM50204241 CHEMBL3917372
SMILES: [H][C@]12CC[C@]([H])(C1)[C@]1([H])[C@@]2([H])CN(c2ccc(C#N)c(c2)C(F)(F)F)S1(=O)=O
InChI Key: InChIKey=IWCSBQHXPCTZJT-FMRSBHEDSA-N
Data: 1 KI  1 IC50
Activity Spreadsheet -- Enzyme Inhibition Constant Data from BindingDB
Found 2 hits for monomerid = 50204241
Trg + Lig
Ki
nM
ΔG°
kcal/mole
IC50
nM
Kd
nM
EC50/IC50
nM
koff
s-1
kon
M-1s-1
pHTemp
°C
Androgen Receptor
(Homo sapiens (Human))
BDBM50204241
(CHEMBL3917372)
Show SMILES [H][C@]12CC[C@]([H])(C1)[C@]1([H])[C@@]2([H])CN(c2ccc(C#N)c(c2)C(F)(F)F)S1(=O)=O |r|
Show InChI InChI=1S/C16H15F3N2O2S/c17-16(18,19)14-6-12(4-3-11(14)7-20)21-8-13-9-1-2-10(5-9)15(13)24(21,22)23/h3-4,6,9-10,13,15H,1-2,5,8H2/t9-,10+,13-,15+/m0/s1
NCI pathway
Reactome pathway
3n/an/an/an/an/an/an/an/a
Bristol-Myers Squibb Research and Development
Curated by ChEMBL
Assay Description
Displacement of [3H]DHT from androgen receptor in human MDA-MB-453 cells
Bioorg Med Chem Lett 26: 5707-5711 (2016)
Article DOI: 10.1016/j.bmcl.2016.10.059
BindingDB Entry DOI: 10.7270/Q2PK0J43
Androgen Receptor
(Homo sapiens (Human))
BDBM50204241
(CHEMBL3917372)
Show SMILES [H][C@]12CC[C@]([H])(C1)[C@]1([H])[C@@]2([H])CN(c2ccc(C#N)c(c2)C(F)(F)F)S1(=O)=O |r|
Show InChI InChI=1S/C16H15F3N2O2S/c17-16(18,19)14-6-12(4-3-11(14)7-20)21-8-13-9-1-2-10(5-9)15(13)24(21,22)23/h3-4,6,9-10,13,15H,1-2,5,8H2/t9-,10+,13-,15+/m0/s1
NCI pathway
Reactome pathway
n/an/a 130n/an/an/an/an/an/a
Bristol-Myers Squibb Research and Development
Curated by ChEMBL
Assay Description
Antagonist activity at androgen receptor in human MDA-MB-453 cells assessed as inhibition of testosterone-induced transactivation
Bioorg Med Chem Lett 26: 5707-5711 (2016)
Article DOI: 10.1016/j.bmcl.2016.10.059
BindingDB Entry DOI: 10.7270/Q2PK0J43