BDBM50204246 CHEMBL3893320
SMILES: [H][C@]12CC[C@]([H])(C1)[C@]1(C(N)=O)[C@@]2([H])CN(c2ccc(C#N)c(c2)C(F)(F)F)S1(=O)=O
InChI Key: InChIKey=MZTKDGVIZFSWEK-CUNZKTQSSA-N
Data: 1 KI  1 IC50
Activity Spreadsheet -- Enzyme Inhibition Constant Data from BindingDB
Found 2 hits for monomerid = 50204246
Trg + Lig
Ki
nM
ΔG°
kcal/mole
IC50
nM
Kd
nM
EC50/IC50
nM
koff
s-1
kon
M-1s-1
pHTemp
°C
Androgen Receptor
(Homo sapiens (Human))
BDBM50204246
(CHEMBL3893320)
Show SMILES [H][C@]12CC[C@]([H])(C1)[C@]1(C(N)=O)[C@@]2([H])CN(c2ccc(C#N)c(c2)C(F)(F)F)S1(=O)=O |r|
Show InChI InChI=1S/C17H16F3N3O3S/c18-17(19,20)13-6-12(4-2-10(13)7-21)23-8-14-9-1-3-11(5-9)16(14,15(22)24)27(23,25)26/h2,4,6,9,11,14H,1,3,5,8H2,(H2,22,24)/t9-,11+,14-,16+/m0/s1
NCI pathway
Reactome pathway
3n/an/an/an/an/an/an/an/a
Bristol-Myers Squibb Research and Development
Curated by ChEMBL
Assay Description
Displacement of [3H]DHT from androgen receptor in human MDA-MB-453 cells
Bioorg Med Chem Lett 26: 5707-5711 (2016)
Article DOI: 10.1016/j.bmcl.2016.10.059
BindingDB Entry DOI: 10.7270/Q2PK0J43
Androgen Receptor
(Homo sapiens (Human))
BDBM50204246
(CHEMBL3893320)
Show SMILES [H][C@]12CC[C@]([H])(C1)[C@]1(C(N)=O)[C@@]2([H])CN(c2ccc(C#N)c(c2)C(F)(F)F)S1(=O)=O |r|
Show InChI InChI=1S/C17H16F3N3O3S/c18-17(19,20)13-6-12(4-2-10(13)7-21)23-8-14-9-1-3-11(5-9)16(14,15(22)24)27(23,25)26/h2,4,6,9,11,14H,1,3,5,8H2,(H2,22,24)/t9-,11+,14-,16+/m0/s1
NCI pathway
Reactome pathway
n/an/a 55n/an/an/an/an/an/a
Bristol-Myers Squibb Research and Development
Curated by ChEMBL
Assay Description
Antagonist activity at androgen receptor in human MDA-MB-453 cells assessed as inhibition of testosterone-induced transactivation
Bioorg Med Chem Lett 26: 5707-5711 (2016)
Article DOI: 10.1016/j.bmcl.2016.10.059
BindingDB Entry DOI: 10.7270/Q2PK0J43