BDBM50204288 CHEMBL3925430
SMILES: Cc1cccc(Nc2nc(N[C@@H]3CCCC[C@@H]3N)c(C)c3CNC(=O)c23)c1
InChI Key: InChIKey=AJASROCNLFYWOD-DLBZAZTESA-N
Data: 1 IC50
Activity Spreadsheet -- Enzyme Inhibition Constant Data from BindingDB
Found 1 hit for monomerid = 50204288
Trg + Lig
Ki
nM
ΔG°
kcal/mole
IC50
nM
Kd
nM
EC50/IC50
nM
koff
s-1
kon
M-1s-1
pHTemp
°C
Tyrosine-protein kinase SYK
(Homo sapiens (Human))
BDBM50204288
(CHEMBL3925430)
Show SMILES Cc1cccc(Nc2nc(N[C@@H]3CCCC[C@@H]3N)c(C)c3CNC(=O)c23)c1 |r|
Show InChI InChI=1S/C21H27N5O/c1-12-6-5-7-14(10-12)24-20-18-15(11-23-21(18)27)13(2)19(26-20)25-17-9-4-3-8-16(17)22/h5-7,10,16-17H,3-4,8-9,11,22H2,1-2H3,(H,23,27)(H2,24,25,26)/t16-,17+/m0/s1
NCI pathway
Reactome pathway
n/an/a 3.10n/an/an/an/an/an/a
Takeda California, Inc.
Curated by ChEMBL
Assay Description
Inhibition of human C-terminal 6His-tagged SYK (356 to 635 residues) expressed in Sf9 insect cells using 5-carboxyfluorescein(FAM)-EEPLYWSFPAKKK-NH2 ...
Bioorg Med Chem Lett 26: 5947-5950 (2016)
Article DOI: 10.1016/j.bmcl.2016.10.087
BindingDB Entry DOI: 10.7270/Q29888Z2