BDBM50204613 CHEMBL3929052
SMILES: CC(=O)NC[C@H]1N[C@H](CO)[C@H](O)[C@@H]1O
InChI Key: InChIKey=UQEQPFWCYJXMDK-XUTVFYLZSA-N
Data: 1 IC50
Activity Spreadsheet -- Enzyme Inhibition Constant Data from BindingDB
Found 1 hit for monomerid = 50204613
Trg + Lig
Ki
nM
ΔG°
kcal/mole
IC50
nM
Kd
nM
EC50/IC50
nM
koff
s-1
kon
M-1s-1
pHTemp
°C
Alpha-galactosidase A
(Homo sapiens (Human))
BDBM50204613
(CHEMBL3929052)
Show SMILES CC(=O)NC[C@H]1N[C@H](CO)[C@H](O)[C@@H]1O |r|
Show InChI InChI=1S/C8H16N2O4/c1-4(12)9-2-5-7(13)8(14)6(3-11)10-5/h5-8,10-11,13-14H,2-3H2,1H3,(H,9,12)/t5-,6-,7-,8+/m1/s1
Reactome pathway
n/an/a 2.21E+4n/an/an/an/a7.0n/a
National Cheng-Kung University
Curated by ChEMBL
Assay Description
Inhibition of human recombinant lysosomal alpha GAL-A using 4-methylberiilyl alpha-D-galactopyranoside as substrate at pH 7 after 15 mins by fluoresc...
Eur J Med Chem 123: 14-20 (2016)
Article DOI: 10.1016/j.ejmech.2016.07.025
BindingDB Entry DOI: 10.7270/Q2RB76KN