BDBM50204815 (R)-N-(4-(4-hydroxyphenyl)butan-2-yl)-2-(2-phenyl-1H-indol-3-yl)acetamide::CHEMBL391910::N-[(1R)-3-(4-HYDROXYPHENYL)-1-METHYLPROPYL]-2-(2-PHENYL-1H-INDOL-3-YL)ACETAMIDE
SMILES: C[C@H](CCc1ccc(O)cc1)NC(=O)Cc1c([nH]c2ccccc12)-c1ccccc1
InChI Key: InChIKey=APLJSSOXDWUNGV-GOSISDBHSA-N
Data: 2 IC50
PDB links: 1 PDB ID matches this monomer.
Activity Spreadsheet -- Enzyme Inhibition Constant Data from BindingDB
Found 2 hits for monomerid = 50204815
Trg + Lig
Ki
nM
ΔG°
kcal/mole
IC50
nM
Kd
nM
EC50/IC50
nM
koff
s-1
kon
M-1s-1
pHTemp
°C
Estradiol receptor beta (ERβ)
(Homo sapiens (Human))
BDBM50204815
((R)-N-(4-(4-hydroxyphenyl)butan-2-yl)-2-(2-phenyl-...)
Show SMILES C[C@H](CCc1ccc(O)cc1)NC(=O)Cc1c([nH]c2ccccc12)-c1ccccc1
Show InChI InChI=1S/C26H26N2O2/c1-18(11-12-19-13-15-21(29)16-14-19)27-25(30)17-23-22-9-5-6-10-24(22)28-26(23)20-7-3-2-4-8-20/h2-10,13-16,18,28-29H,11-12,17H2,1H3,(H,27,30)/t18-/m1/s1
n/an/a 94n/an/an/an/an/an/a
Merck Research Laboratories
Curated by ChEMBL
Assay Description
Displacement of [3H]estradiol from full length human recombinant ERbeta after 3 hrs by scintillation proximity assay
Bioorg Med Chem Lett 17: 2322-8 (2007)
Article DOI: 10.1016/j.bmcl.2007.01.054
BindingDB Entry DOI: 10.7270/Q2PC322G
Estrogen receptor
(Homo sapiens (Human))
BDBM50204815
((R)-N-(4-(4-hydroxyphenyl)butan-2-yl)-2-(2-phenyl-...)
Show SMILES C[C@H](CCc1ccc(O)cc1)NC(=O)Cc1c([nH]c2ccccc12)-c1ccccc1
Show InChI InChI=1S/C26H26N2O2/c1-18(11-12-19-13-15-21(29)16-14-19)27-25(30)17-23-22-9-5-6-10-24(22)28-26(23)20-7-3-2-4-8-20/h2-10,13-16,18,28-29H,11-12,17H2,1H3,(H,27,30)/t18-/m1/s1
n/an/a 1n/an/an/an/an/an/a
Merck Research Laboratories
Curated by ChEMBL
Assay Description
Displacement of [3H]estradiol from full length human recombinant ERalpha after 3 hrs by scintillation proximity assay
Bioorg Med Chem Lett 17: 2322-8 (2007)
Article DOI: 10.1016/j.bmcl.2007.01.054
BindingDB Entry DOI: 10.7270/Q2PC322G
3D
3D Structure (crystal)