BDBM50204820 (S)-N-benzyl-3-{[(R)-1-(4-guanidino-butyryl)-pyrrolidine-2-carbonyl]-amino}-succinamic acid::CHEMBL241108
SMILES: [#7]\[#6](-[#7])=[#7]\[#6]-[#6]-[#6]-[#6](=O)-[#7]-1-[#6]-[#6]-[#6]-[#6@@H]-1-[#6](=O)-[#7]-[#6@@H](-[#6]-[#6](-[#8])=O)-[#6](=O)-[#7]-[#6]-c1ccccc1
InChI Key: InChIKey=JTVISWUXVOHMNE-JKSUJKDBSA-N
Data: 1 IC50
Activity Spreadsheet -- Enzyme Inhibition Constant Data from BindingDB
Found 1 hit for monomerid = 50204820
Trg + Lig
Ki
nM
ΔG°
kcal/mole
IC50
nM
Kd
nM
EC50/IC50
nM
koff
s-1
kon
M-1s-1
pHTemp
°C
ITGAV/ITGB3
(Homo sapiens (Human))
BDBM50204820
((S)-N-benzyl-3-{[(R)-1-(4-guanidino-butyryl)-pyrro...)
Show SMILES [#7]\[#6](-[#7])=[#7]\[#6]-[#6]-[#6]-[#6](=O)-[#7]-1-[#6]-[#6]-[#6]-[#6@@H]-1-[#6](=O)-[#7]-[#6@@H](-[#6]-[#6](-[#8])=O)-[#6](=O)-[#7]-[#6]-c1ccccc1
Show InChI InChI=1S/C21H30N6O5/c22-21(23)24-10-4-9-17(28)27-11-5-8-16(27)20(32)26-15(12-18(29)30)19(31)25-13-14-6-2-1-3-7-14/h1-3,6-7,15-16H,4-5,8-13H2,(H,25,31)(H,26,32)(H,29,30)(H4,22,23,24)/t15-,16+/m0/s1
n/an/a 26n/an/an/an/an/an/a
Universit£ degli Studi di Bologna
Curated by ChEMBL
Assay Description
Inhibition of integrin alpha-v-beta-3 receptor-mediated human SK-MEL-24 cell adhesion to fibronectin by fluorimetry
Bioorg Med Chem Lett 17: 2329-33 (2007)
Article DOI: 10.1016/j.bmcl.2007.01.073
BindingDB Entry DOI: 10.7270/Q2NK3G8W