BDBM50205159 CHEMBL230825::biphenyl-4-sulfonic acid [(1S,2S)-3-(4-chloro-phenyl)-2-(3-cyano-phenyl)-1-methyl-propyl]-amide
SMILES: C[C@H](NS(=O)(=O)c1ccc(cc1)-c1ccccc1)[C@@H](Cc1ccc(Cl)cc1)c1cccc(c1)C#N
InChI Key: InChIKey=LRNWPKUMWXTQRX-KCWXNJEJSA-N
Data: 2 IC50
Activity Spreadsheet -- Enzyme Inhibition Constant Data from BindingDB
Found 2 hits for monomerid = 50205159
Trg + Lig
Ki
nM
ΔG°
kcal/mole
IC50
nM
Kd
nM
EC50/IC50
nM
koff
s-1
kon
M-1s-1
pHTemp
°C
Cannabinoid receptor 1
(Homo sapiens (Human))
BDBM50205159
(CHEMBL230825 | biphenyl-4-sulfonic acid [(1S,2S)-3...)
Show SMILES C[C@H](NS(=O)(=O)c1ccc(cc1)-c1ccccc1)[C@@H](Cc1ccc(Cl)cc1)c1cccc(c1)C#N
Show InChI InChI=1S/C29H25ClN2O2S/c1-21(32-35(33,34)28-16-12-25(13-17-28)24-7-3-2-4-8-24)29(19-22-10-14-27(30)15-11-22)26-9-5-6-23(18-26)20-31/h2-18,21,29,32H,19H2,1H3/t21-,29+/m0/s1
NCI pathway
Reactome pathway
n/an/a 23n/an/an/an/an/an/a
Merck Research Laboratories
Curated by ChEMBL
Assay Description
Displacement of [3H]CP55940 from human recombinant CB1 receptor expressed in CHO cells
Bioorg Med Chem Lett 17: 2184-7 (2007)
Article DOI: 10.1016/j.bmcl.2007.01.087
BindingDB Entry DOI: 10.7270/Q2HM584G
Cannabinoid receptor 2
(Homo sapiens (Human))
BDBM50205159
(CHEMBL230825 | biphenyl-4-sulfonic acid [(1S,2S)-3...)
Show SMILES C[C@H](NS(=O)(=O)c1ccc(cc1)-c1ccccc1)[C@@H](Cc1ccc(Cl)cc1)c1cccc(c1)C#N
Show InChI InChI=1S/C29H25ClN2O2S/c1-21(32-35(33,34)28-16-12-25(13-17-28)24-7-3-2-4-8-24)29(19-22-10-14-27(30)15-11-22)26-9-5-6-23(18-26)20-31/h2-18,21,29,32H,19H2,1H3/t21-,29+/m0/s1
Reactome pathway
n/an/a 406n/an/an/an/an/an/a
Merck Research Laboratories
Curated by ChEMBL
Assay Description
Displacement of [3H]CP55940 from human recombinant CB2 receptor expressed in CHO cells
Bioorg Med Chem Lett 17: 2184-7 (2007)
Article DOI: 10.1016/j.bmcl.2007.01.087
BindingDB Entry DOI: 10.7270/Q2HM584G