BDBM50205177 CHEMBL397243::N-((2S,3S)-4-(4-chlorophenyl)-3-(3-cyanophenyl)butan-2-yl)benzenesulfonamide
SMILES: C[C@H](NS(=O)(=O)c1ccccc1)[C@@H](Cc1ccc(Cl)cc1)c1cccc(c1)C#N
InChI Key: InChIKey=WREOHEGCYKJUFI-GAJHUEQPSA-N
Data: 2 IC50
Activity Spreadsheet -- Enzyme Inhibition Constant Data from BindingDB
Found 2 hits for monomerid = 50205177
Trg + Lig
Ki
nM
ΔG°
kcal/mole
IC50
nM
Kd
nM
EC50/IC50
nM
koff
s-1
kon
M-1s-1
pHTemp
°C
Cannabinoid receptor 2
(Homo sapiens (Human))
BDBM50205177
(CHEMBL397243 | N-((2S,3S)-4-(4-chlorophenyl)-3-(3-...)
Show SMILES C[C@H](NS(=O)(=O)c1ccccc1)[C@@H](Cc1ccc(Cl)cc1)c1cccc(c1)C#N
Show InChI InChI=1S/C23H21ClN2O2S/c1-17(26-29(27,28)22-8-3-2-4-9-22)23(15-18-10-12-21(24)13-11-18)20-7-5-6-19(14-20)16-25/h2-14,17,23,26H,15H2,1H3/t17-,23+/m0/s1
Reactome pathway
n/an/a 1.49E+3n/an/an/an/an/an/a
Merck Research Laboratories
Curated by ChEMBL
Assay Description
Displacement of [3H]CP55940 from human recombinant CB2 receptor expressed in CHO cells
Bioorg Med Chem Lett 17: 2184-7 (2007)
Article DOI: 10.1016/j.bmcl.2007.01.087
BindingDB Entry DOI: 10.7270/Q2HM584G
Cannabinoid receptor 1
(Homo sapiens (Human))
BDBM50205177
(CHEMBL397243 | N-((2S,3S)-4-(4-chlorophenyl)-3-(3-...)
Show SMILES C[C@H](NS(=O)(=O)c1ccccc1)[C@@H](Cc1ccc(Cl)cc1)c1cccc(c1)C#N
Show InChI InChI=1S/C23H21ClN2O2S/c1-17(26-29(27,28)22-8-3-2-4-9-22)23(15-18-10-12-21(24)13-11-18)20-7-5-6-19(14-20)16-25/h2-14,17,23,26H,15H2,1H3/t17-,23+/m0/s1
NCI pathway
Reactome pathway
n/an/a 9.70n/an/an/an/an/an/a
Merck Research Laboratories
Curated by ChEMBL
Assay Description
Displacement of [3H]CP55940 from human recombinant CB1 receptor expressed in CHO cells
Bioorg Med Chem Lett 17: 2184-7 (2007)
Article DOI: 10.1016/j.bmcl.2007.01.087
BindingDB Entry DOI: 10.7270/Q2HM584G