BDBM50205185 CHEMBL389353::N-((2S,3S)-4-(4-chlorophenyl)-3-(3-cyanophenyl)butan-2-yl)naphthalene-2-sulfonamide
SMILES: C[C@H](NS(=O)(=O)c1ccc2ccccc2c1)[C@@H](Cc1ccc(Cl)cc1)c1cccc(c1)C#N
InChI Key: InChIKey=DZKNASAQOCKUCJ-UZTOHYMASA-N
Data: 2 IC50
Activity Spreadsheet -- Enzyme Inhibition Constant Data from BindingDB
Found 2 hits for monomerid = 50205185
Trg + Lig
Ki
nM
ΔG°
kcal/mole
IC50
nM
Kd
nM
EC50/IC50
nM
koff
s-1
kon
M-1s-1
pHTemp
°C
Cannabinoid receptor 1
(Homo sapiens (Human))
BDBM50205185
(CHEMBL389353 | N-((2S,3S)-4-(4-chlorophenyl)-3-(3-...)
Show SMILES C[C@H](NS(=O)(=O)c1ccc2ccccc2c1)[C@@H](Cc1ccc(Cl)cc1)c1cccc(c1)C#N
Show InChI InChI=1S/C27H23ClN2O2S/c1-19(30-33(31,32)26-14-11-22-6-2-3-7-23(22)17-26)27(16-20-9-12-25(28)13-10-20)24-8-4-5-21(15-24)18-29/h2-15,17,19,27,30H,16H2,1H3/t19-,27+/m0/s1
NCI pathway
Reactome pathway
n/an/a 15n/an/an/an/an/an/a
Merck Research Laboratories
Curated by ChEMBL
Assay Description
Displacement of [3H]CP55940 from human recombinant CB1 receptor expressed in CHO cells
Bioorg Med Chem Lett 17: 2184-7 (2007)
Article DOI: 10.1016/j.bmcl.2007.01.087
BindingDB Entry DOI: 10.7270/Q2HM584G
Cannabinoid receptor 2
(Homo sapiens (Human))
BDBM50205185
(CHEMBL389353 | N-((2S,3S)-4-(4-chlorophenyl)-3-(3-...)
Show SMILES C[C@H](NS(=O)(=O)c1ccc2ccccc2c1)[C@@H](Cc1ccc(Cl)cc1)c1cccc(c1)C#N
Show InChI InChI=1S/C27H23ClN2O2S/c1-19(30-33(31,32)26-14-11-22-6-2-3-7-23(22)17-26)27(16-20-9-12-25(28)13-10-20)24-8-4-5-21(15-24)18-29/h2-15,17,19,27,30H,16H2,1H3/t19-,27+/m0/s1
Reactome pathway
n/an/a 1.09E+3n/an/an/an/an/an/a
Merck Research Laboratories
Curated by ChEMBL
Assay Description
Displacement of [3H]CP55940 from human recombinant CB2 receptor expressed in CHO cells
Bioorg Med Chem Lett 17: 2184-7 (2007)
Article DOI: 10.1016/j.bmcl.2007.01.087
BindingDB Entry DOI: 10.7270/Q2HM584G