BDBM50205307 CHEMBL412742::d[Cha4,Dab8]VP
SMILES: NCC[C@H](NC(=O)[C@@H]1CCCN1C(=O)[C@@H]1CSSCCC(=O)N[C@@H](Cc2ccc(O)cc2)C(=O)N[C@@H](Cc2ccccc2)C(=O)N[C@@H](CC2CCCCC2)C(=O)N[C@@H](CC(N)=O)C(=O)N1)C(=O)NCC(N)=O
InChI Key: InChIKey=DPVYQFBOSXXNLG-CXWHUAPYSA-N
Data: 4 KI  1 Kd
Activity Spreadsheet -- Enzyme Inhibition Constant Data from BindingDB
Found 5 hits for monomerid = 50205307
Trg + Lig
Ki
nM
ΔG°
kcal/mole
IC50
nM
Kd
nM
EC50/IC50
nM
koff
s-1
kon
M-1s-1
pHTemp
°C
Vasopressin receptor
(RAT)
BDBM50205307
(CHEMBL412742 | d[Cha4,Dab8]VP)
Show SMILES NCC[C@H](NC(=O)[C@@H]1CCCN1C(=O)[C@@H]1CSSCCC(=O)N[C@@H](Cc2ccc(O)cc2)C(=O)N[C@@H](Cc2ccccc2)C(=O)N[C@@H](CC2CCCCC2)C(=O)N[C@@H](CC(N)=O)C(=O)N1)C(=O)NCC(N)=O
Show InChI InChI=1S/C48H67N11O11S2/c49-19-17-32(42(64)52-26-40(51)62)54-47(69)38-12-7-20-59(38)48(70)37-27-72-71-21-18-41(63)53-33(24-30-13-15-31(60)16-14-30)43(65)55-34(22-28-8-3-1-4-9-28)44(66)56-35(23-29-10-5-2-6-11-29)45(67)57-36(25-39(50)61)46(68)58-37/h1,3-4,8-9,13-16,29,32-38,60H,2,5-7,10-12,17-27,49H2,(H2,50,61)(H2,51,62)(H,52,64)(H,53,63)(H,54,69)(H,55,65)(H,56,66)(H,57,67)(H,58,68)/t32-,33-,34-,35-,36-,37-,38-/m0/s1
0.800n/an/an/an/an/an/an/an/a
INSERM
Curated by ChEMBL
Assay Description
Displacement of [3H]AVP from rat vasopressin V1b receptor expressed in At-T20 cells
J Med Chem 50: 835-47 (2007)
Article DOI: 10.1021/jm060928n
BindingDB Entry DOI: 10.7270/Q2G161NH
Oxytocin receptor
(RAT)
BDBM50205307
(CHEMBL412742 | d[Cha4,Dab8]VP)
Show SMILES NCC[C@H](NC(=O)[C@@H]1CCCN1C(=O)[C@@H]1CSSCCC(=O)N[C@@H](Cc2ccc(O)cc2)C(=O)N[C@@H](Cc2ccccc2)C(=O)N[C@@H](CC2CCCCC2)C(=O)N[C@@H](CC(N)=O)C(=O)N1)C(=O)NCC(N)=O
Show InChI InChI=1S/C48H67N11O11S2/c49-19-17-32(42(64)52-26-40(51)62)54-47(69)38-12-7-20-59(38)48(70)37-27-72-71-21-18-41(63)53-33(24-30-13-15-31(60)16-14-30)43(65)55-34(22-28-8-3-1-4-9-28)44(66)56-35(23-29-10-5-2-6-11-29)45(67)57-36(25-39(50)61)46(68)58-37/h1,3-4,8-9,13-16,29,32-38,60H,2,5-7,10-12,17-27,49H2,(H2,50,61)(H2,51,62)(H,52,64)(H,53,63)(H,54,69)(H,55,65)(H,56,66)(H,57,67)(H,58,68)/t32-,33-,34-,35-,36-,37-,38-/m0/s1
Reactome pathway
430n/an/an/an/an/an/an/an/a
INSERM
Curated by ChEMBL
Assay Description
Displacement of [3H]AVP from rat OT receptor expressed in CHO cells
J Med Chem 50: 835-47 (2007)
Article DOI: 10.1021/jm060928n
BindingDB Entry DOI: 10.7270/Q2G161NH
Vasopressin V2 Receptor
(Rattus norvegicus (Rat))
BDBM50205307
(CHEMBL412742 | d[Cha4,Dab8]VP)
Show SMILES NCC[C@H](NC(=O)[C@@H]1CCCN1C(=O)[C@@H]1CSSCCC(=O)N[C@@H](Cc2ccc(O)cc2)C(=O)N[C@@H](Cc2ccccc2)C(=O)N[C@@H](CC2CCCCC2)C(=O)N[C@@H](CC(N)=O)C(=O)N1)C(=O)NCC(N)=O
Show InChI InChI=1S/C48H67N11O11S2/c49-19-17-32(42(64)52-26-40(51)62)54-47(69)38-12-7-20-59(38)48(70)37-27-72-71-21-18-41(63)53-33(24-30-13-15-31(60)16-14-30)43(65)55-34(22-28-8-3-1-4-9-28)44(66)56-35(23-29-10-5-2-6-11-29)45(67)57-36(25-39(50)61)46(68)58-37/h1,3-4,8-9,13-16,29,32-38,60H,2,5-7,10-12,17-27,49H2,(H2,50,61)(H2,51,62)(H,52,64)(H,53,63)(H,54,69)(H,55,65)(H,56,66)(H,57,67)(H,58,68)/t32-,33-,34-,35-,36-,37-,38-/m0/s1
Reactome pathway
450n/an/an/an/an/an/an/an/a
INSERM
Curated by ChEMBL
Assay Description
Displacement of [3H]AVP from vasopressin V2 receptor in rat kidney membranes
J Med Chem 50: 835-47 (2007)
Article DOI: 10.1021/jm060928n
BindingDB Entry DOI: 10.7270/Q2G161NH
AVPR1A
(RAT)
BDBM50205307
(CHEMBL412742 | d[Cha4,Dab8]VP)
Show SMILES NCC[C@H](NC(=O)[C@@H]1CCCN1C(=O)[C@@H]1CSSCCC(=O)N[C@@H](Cc2ccc(O)cc2)C(=O)N[C@@H](Cc2ccccc2)C(=O)N[C@@H](CC2CCCCC2)C(=O)N[C@@H](CC(N)=O)C(=O)N1)C(=O)NCC(N)=O
Show InChI InChI=1S/C48H67N11O11S2/c49-19-17-32(42(64)52-26-40(51)62)54-47(69)38-12-7-20-59(38)48(70)37-27-72-71-21-18-41(63)53-33(24-30-13-15-31(60)16-14-30)43(65)55-34(22-28-8-3-1-4-9-28)44(66)56-35(23-29-10-5-2-6-11-29)45(67)57-36(25-39(50)61)46(68)58-37/h1,3-4,8-9,13-16,29,32-38,60H,2,5-7,10-12,17-27,49H2,(H2,50,61)(H2,51,62)(H,52,64)(H,53,63)(H,54,69)(H,55,65)(H,56,66)(H,57,67)(H,58,68)/t32-,33-,34-,35-,36-,37-,38-/m0/s1
4.40E+3n/an/an/an/an/an/an/an/a
INSERM
Curated by ChEMBL
Assay Description
Displacement of [3H]AVP from vasopressin V1a receptor in rat liver membrane
J Med Chem 50: 835-47 (2007)
Article DOI: 10.1021/jm060928n
BindingDB Entry DOI: 10.7270/Q2G161NH
Oxytocin receptor
(Homo sapiens (Human))
BDBM50205307
(CHEMBL412742 | d[Cha4,Dab8]VP)
Show SMILES NCC[C@H](NC(=O)[C@@H]1CCCN1C(=O)[C@@H]1CSSCCC(=O)N[C@@H](Cc2ccc(O)cc2)C(=O)N[C@@H](Cc2ccccc2)C(=O)N[C@@H](CC2CCCCC2)C(=O)N[C@@H](CC(N)=O)C(=O)N1)C(=O)NCC(N)=O
Show InChI InChI=1S/C48H67N11O11S2/c49-19-17-32(42(64)52-26-40(51)62)54-47(69)38-12-7-20-59(38)48(70)37-27-72-71-21-18-41(63)53-33(24-30-13-15-31(60)16-14-30)43(65)55-34(22-28-8-3-1-4-9-28)44(66)56-35(23-29-10-5-2-6-11-29)45(67)57-36(25-39(50)61)46(68)58-37/h1,3-4,8-9,13-16,29,32-38,60H,2,5-7,10-12,17-27,49H2,(H2,50,61)(H2,51,62)(H,52,64)(H,53,63)(H,54,69)(H,55,65)(H,56,66)(H,57,67)(H,58,68)/t32-,33-,34-,35-,36-,37-,38-/m0/s1
Reactome pathway
n/an/an/a 447n/an/an/an/an/a
INSERM
Curated by ChEMBL
Assay Description
Activity at OT receptor assessed as oxytocic activity in absence of magnesium
J Med Chem 50: 835-47 (2007)
Article DOI: 10.1021/jm060928n
BindingDB Entry DOI: 10.7270/Q2G161NH