BDBM50205372 5-methylbenzene-1,2,3-triol::CHEMBL374735
SMILES: Cc1cc(O)c(O)c(O)c1
InChI Key: InChIKey=NYUABOGYMWADSF-UHFFFAOYSA-N
Data: 3 IC50
Activity Spreadsheet -- Enzyme Inhibition Constant Data from BindingDB
Found 3 hits for monomerid = 50205372
Trg + Lig
Ki
nM
ΔG°
kcal/mole
IC50
nM
Kd
nM
EC50/IC50
nM
koff
s-1
kon
M-1s-1
pHTemp
°C
Leukocyte adhesion molecule-1
(Homo sapiens (Human))
BDBM50205372
(5-methylbenzene-1,2,3-triol | CHEMBL374735)
Show SMILES Cc1cc(O)c(O)c(O)c1
Show InChI InChI=1S/C7H8O3/c1-4-2-5(8)7(10)6(9)3-4/h2-3,8-10H,1H3
Reactome pathway
n/an/a 3.85E+4n/an/an/an/an/an/a
Revotar Biopharmaceuticals AG
Curated by ChEMBL
Assay Description
Inhibition of human L-selectin after 2 hrs
J Med Chem 50: 1101-15 (2007)
Article DOI: 10.1021/jm060536g
BindingDB Entry DOI: 10.7270/Q2TB17Q6
Selectin E
(Homo sapiens (Human))
BDBM50205372
(5-methylbenzene-1,2,3-triol | CHEMBL374735)
Show SMILES Cc1cc(O)c(O)c(O)c1
Show InChI InChI=1S/C7H8O3/c1-4-2-5(8)7(10)6(9)3-4/h2-3,8-10H,1H3
NCI pathway
Reactome pathway
n/an/a 3.17E+4n/an/an/an/an/an/a
Revotar Biopharmaceuticals AG
Curated by ChEMBL
Assay Description
Inhibition of human E-selectin after 2 hrs
J Med Chem 50: 1101-15 (2007)
Article DOI: 10.1021/jm060536g
BindingDB Entry DOI: 10.7270/Q2TB17Q6
P-selectin/P-selectin glycoprotein ligand 1
(Homo sapiens (Human))
BDBM50205372
(5-methylbenzene-1,2,3-triol | CHEMBL374735)
Show SMILES Cc1cc(O)c(O)c(O)c1
Show InChI InChI=1S/C7H8O3/c1-4-2-5(8)7(10)6(9)3-4/h2-3,8-10H,1H3
NCI pathway
Reactome pathway
n/an/a 3.18E+4n/an/an/an/an/an/a
Revotar Biopharmaceuticals AG
Curated by ChEMBL
Assay Description
Inhibition of human P-selectin after 2 hrs
J Med Chem 50: 1101-15 (2007)
Article DOI: 10.1021/jm060536g
BindingDB Entry DOI: 10.7270/Q2TB17Q6