BDBM50205515 4-(2-(1-benzhydryl-5-chloro-2-(2-((3,4-dichlorophenyl)methylsulfonamido)ethyl)-1H-indol-3-yl)ethoxy)benzoic acid::4-{2-[5-chloro-2-(2-{[(3,4-dichlorobenzyl)sulfonyl]amino}-ethyl)-1-(diphenylmethyl)-1H-indol-3-yl]ethoxy}benzoic acid::CHEMBL269787
SMILES: OC(=O)c1ccc(OCCc2c(CCNS(=O)(=O)Cc3ccc(Cl)c(Cl)c3)n(C(c3ccccc3)c3ccccc3)c3ccc(Cl)cc23)cc1
InChI Key: InChIKey=FMMCHWHNSUBYAV-UHFFFAOYSA-N
Data: 2 IC50  1 Kd
Activity Spreadsheet -- Enzyme Inhibition Constant Data from BindingDB
Found 3 hits for monomerid = 50205515
Trg + Lig
Ki
nM
ΔG°
kcal/mole
IC50
nM
Kd
nM
EC50/IC50
nM
koff
s-1
kon
M-1s-1
pHTemp
°C
cPLA2 C2
(Homo sapiens (Human))
BDBM50205515
(4-(2-(1-benzhydryl-5-chloro-2-(2-((3,4-dichlorophe...)
Show SMILES OC(=O)c1ccc(OCCc2c(CCNS(=O)(=O)Cc3ccc(Cl)c(Cl)c3)n(C(c3ccccc3)c3ccccc3)c3ccc(Cl)cc23)cc1
Show InChI InChI=1S/C39H33Cl3N2O5S/c40-30-14-18-36-33(24-30)32(20-22-49-31-15-12-29(13-16-31)39(45)46)37(19-21-43-50(47,48)25-26-11-17-34(41)35(42)23-26)44(36)38(27-7-3-1-4-8-27)28-9-5-2-6-10-28/h1-18,23-24,38,43H,19-22,25H2,(H,45,46)
n/an/a 150n/an/an/an/an/an/a
Wyeth Research
Curated by ChEMBL
Assay Description
Inhibition of human cPLA2 alpha by GLU micelle assay
J Med Chem 50: 1380-400 (2007)
Article DOI: 10.1021/jm061131z
BindingDB Entry DOI: 10.7270/Q23F4PB9
cPLA2 C2
(Homo sapiens (Human))
BDBM50205515
(4-(2-(1-benzhydryl-5-chloro-2-(2-((3,4-dichlorophe...)
Show SMILES OC(=O)c1ccc(OCCc2c(CCNS(=O)(=O)Cc3ccc(Cl)c(Cl)c3)n(C(c3ccccc3)c3ccccc3)c3ccc(Cl)cc23)cc1
Show InChI InChI=1S/C39H33Cl3N2O5S/c40-30-14-18-36-33(24-30)32(20-22-49-31-15-12-29(13-16-31)39(45)46)37(19-21-43-50(47,48)25-26-11-17-34(41)35(42)23-26)44(36)38(27-7-3-1-4-8-27)28-9-5-2-6-10-28/h1-18,23-24,38,43H,19-22,25H2,(H,45,46)
n/an/a 150n/an/an/an/an/an/a
Wyeth Research
Curated by ChEMBL
Assay Description
Inhibition of human cytosolic PLA2alpha by GLU micelle assay
J Med Chem 52: 1156-71 (2009)
Article DOI: 10.1021/jm8009876
BindingDB Entry DOI: 10.7270/Q20C4VSK
cPLA2 C2
(Homo sapiens (Human))
BDBM50205515
(4-(2-(1-benzhydryl-5-chloro-2-(2-((3,4-dichlorophe...)
Show SMILES OC(=O)c1ccc(OCCc2c(CCNS(=O)(=O)Cc3ccc(Cl)c(Cl)c3)n(C(c3ccccc3)c3ccccc3)c3ccc(Cl)cc23)cc1
Show InChI InChI=1S/C39H33Cl3N2O5S/c40-30-14-18-36-33(24-30)32(20-22-49-31-15-12-29(13-16-31)39(45)46)37(19-21-43-50(47,48)25-26-11-17-34(41)35(42)23-26)44(36)38(27-7-3-1-4-8-27)28-9-5-2-6-10-28/h1-18,23-24,38,43H,19-22,25H2,(H,45,46)
n/an/an/a 139n/an/an/an/an/a
Wyeth Research
Curated by ChEMBL
Assay Description
Binding affinity to human cPLA2 alpha by isothermal calorimetry
J Med Chem 50: 1380-400 (2007)
Article DOI: 10.1021/jm061131z
BindingDB Entry DOI: 10.7270/Q23F4PB9