BDBM50205606 CHEMBL3945980
SMILES: COc1ccc(cc1)C1=NNC(=O)CCC1
InChI Key: InChIKey=DHAZMUXQCKRVMY-UHFFFAOYSA-N
Data: 1 IC50
Activity Spreadsheet -- Enzyme Inhibition Constant Data from BindingDB
Found 1 hit for monomerid = 50205606
Trg + Lig
Ki
nM
ΔG°
kcal/mole
IC50
nM
Kd
nM
EC50/IC50
nM
koff
s-1
kon
M-1s-1
pHTemp
°C
cAMP-specific 3',5'-cyclic phosphodiesterase 4B
(Homo sapiens (Human))
BDBM50205606
(CHEMBL3945980)
Show SMILES COc1ccc(cc1)C1=NNC(=O)CCC1 |t:9|
Show InChI InChI=1S/C12H14N2O2/c1-16-10-7-5-9(6-8-10)11-3-2-4-12(15)14-13-11/h5-8H,2-4H2,1H3,(H,14,15)
n/an/a>3.00E+4n/an/an/an/an/an/a
University of Genoa
Curated by ChEMBL
Assay Description
Inhibition of human recombinant PDE4B2 using cAMP as substrate after 2 hrs by TR-FRET assay
Bioorg Med Chem Lett 27: 24-29 (2017)
Article DOI: 10.1016/j.bmcl.2016.11.040
BindingDB Entry DOI: 10.7270/Q21N8333