BDBM50205612 CHEMBL3910284
SMILES: COc1ccc(cc1OC)C1=NN(CC(O)=O)C(=O)CC(C)(C)C1
InChI Key: InChIKey=XVXWJTFSUJMCPX-UHFFFAOYSA-N
Data: 1 IC50
Activity Spreadsheet -- Enzyme Inhibition Constant Data from BindingDB
Found 1 hit for monomerid = 50205612
Trg + Lig
Ki
nM
ΔG°
kcal/mole
IC50
nM
Kd
nM
EC50/IC50
nM
koff
s-1
kon
M-1s-1
pHTemp
°C
cAMP-specific 3',5'-cyclic phosphodiesterase 4B
(Homo sapiens (Human))
BDBM50205612
(CHEMBL3910284)
Show SMILES COc1ccc(cc1OC)C1=NN(CC(O)=O)C(=O)CC(C)(C)C1 |t:11|
Show InChI InChI=1S/C17H22N2O5/c1-17(2)8-12(18-19(10-16(21)22)15(20)9-17)11-5-6-13(23-3)14(7-11)24-4/h5-7H,8-10H2,1-4H3,(H,21,22)
n/an/a 1.31E+4n/an/an/an/an/an/a
University of Genoa
Curated by ChEMBL
Assay Description
Inhibition of human recombinant PDE4B2 using cAMP as substrate after 2 hrs by TR-FRET assay
Bioorg Med Chem Lett 27: 24-29 (2017)
Article DOI: 10.1016/j.bmcl.2016.11.040
BindingDB Entry DOI: 10.7270/Q21N8333