null
SMILES: CC1CN(C2CCCC2)c2cc(cc(C(=O)NCc3c(C)cc(C)[nH]c3=O)c12)-c1ccc(nc1)N1CCNCC1
InChI Key: InChIKey=WZMNJYXLTFTXGO-UHFFFAOYSA-N
Activity Spreadsheet -- Enzyme Inhibition Constant Data from BindingDB
Found 3 hits for monomerid = 50205635
Trg + Lig
Ki
nM
ΔG°
kcal/mole
IC50
nM
Kd
nM
EC50/IC50
nM
koff
s-1
kon
M-1s-1
pHTemp
°C
Histone-lysine N-methyltransferase EZH2
(Homo sapiens (Human))
BDBM50205635
(CHEMBL3898133)
Show SMILES CC1CN(C2CCCC2)c2cc(cc(C(=O)NCc3c(C)cc(C)[nH]c3=O)c12)-c1ccc(nc1)N1CCNCC1
Show InChI InChI=1S/C32H40N6O2/c1-20-14-22(3)36-32(40)27(20)18-35-31(39)26-15-24(23-8-9-29(34-17-23)37-12-10-33-11-13-37)16-28-30(26)21(2)19-38(28)25-6-4-5-7-25/h8-9,14-17,21,25,33H,4-7,10-13,18-19H2,1-3H3,(H,35,39)(H,36,40)
n/an/a 378n/an/an/an/an/an/a
Integral BioSciences Pvt. Ltd.
Curated by ChEMBL
Assay Description
Inhibition of human wild type EZH2 using histone H3 as substrate after 1 hr in presence of 3H-SAM by filter paper detection analysis
Bioorg Med Chem Lett 27: 217-222 (2017)
Article DOI: 10.1016/j.bmcl.2016.11.080
BindingDB Entry DOI: 10.7270/Q2S46TZW
Histone-lysine N-methyltransferase EZH2
(Homo sapiens (Human))
BDBM50205635
(CHEMBL3898133)
Show SMILES CC1CN(C2CCCC2)c2cc(cc(C(=O)NCc3c(C)cc(C)[nH]c3=O)c12)-c1ccc(nc1)N1CCNCC1
Show InChI InChI=1S/C32H40N6O2/c1-20-14-22(3)36-32(40)27(20)18-35-31(39)26-15-24(23-8-9-29(34-17-23)37-12-10-33-11-13-37)16-28-30(26)21(2)19-38(28)25-6-4-5-7-25/h8-9,14-17,21,25,33H,4-7,10-13,18-19H2,1-3H3,(H,35,39)(H,36,40)
n/an/a 21n/an/an/an/an/an/a
Integral BioSciences Pvt. Ltd.
Curated by ChEMBL
Assay Description
Inhibition of human wild type EZH2 using histone H3 as substrate after 1 hr in presence of 3H-SAM by filter paper detection analysis
Bioorg Med Chem Lett 27: 217-222 (2017)
Article DOI: 10.1016/j.bmcl.2016.11.080
BindingDB Entry DOI: 10.7270/Q2S46TZW
Histone-lysine N-methyltransferase EZH1
(Homo sapiens (Human))
BDBM50205635
(CHEMBL3898133)
Show SMILES CC1CN(C2CCCC2)c2cc(cc(C(=O)NCc3c(C)cc(C)[nH]c3=O)c12)-c1ccc(nc1)N1CCNCC1
Show InChI InChI=1S/C32H40N6O2/c1-20-14-22(3)36-32(40)27(20)18-35-31(39)26-15-24(23-8-9-29(34-17-23)37-12-10-33-11-13-37)16-28-30(26)21(2)19-38(28)25-6-4-5-7-25/h8-9,14-17,21,25,33H,4-7,10-13,18-19H2,1-3H3,(H,35,39)(H,36,40)
n/an/a 1.35E+3n/an/an/an/an/an/a
Integral BioSciences Pvt. Ltd.
Curated by ChEMBL
Assay Description
Inhibition of human EZH1 complex using histone H3 as substrate after 1 hr in presence of 3H-SAM by filter paper detection analysis
Bioorg Med Chem Lett 27: 217-222 (2017)
Article DOI: 10.1016/j.bmcl.2016.11.080
BindingDB Entry DOI: 10.7270/Q2S46TZW