BDBM50205856 (R)-9-cyclopropyl-1,3,4,10b-tetrahydro-7-trifluoromethylpyrazino[2,1-a]isoindol-6(2H)-one::CHEMBL375170
SMILES: FC(F)(F)c1cc(cc2[C@@H]3CNCCN3C(=O)c12)C1CC1
InChI Key: InChIKey=SZJSOYXYBMPMRH-LBPRGKRZSA-N
Data: 3 KI  3 EC50
Activity Spreadsheet -- Enzyme Inhibition Constant Data from BindingDB
Found 6 hits for monomerid = 50205856
Trg + Lig
Ki
nM
ΔG°
kcal/mole
IC50
nM
Kd
nM
EC50/IC50
nM
koff
s-1
kon
M-1s-1
pHTemp
°C
5-hydroxytryptamine receptor 2C
(Homo sapiens (Human))
BDBM50205856
((R)-9-cyclopropyl-1,3,4,10b-tetrahydro-7-trifluoro...)
Show SMILES FC(F)(F)c1cc(cc2[C@@H]3CNCCN3C(=O)c12)C1CC1
Show InChI InChI=1S/C15H15F3N2O/c16-15(17,18)11-6-9(8-1-2-8)5-10-12-7-19-3-4-20(12)14(21)13(10)11/h5-6,8,12,19H,1-4,7H2/t12-/m0/s1
Reactome pathway
35n/an/an/an/an/an/an/an/a
Pharmaceutical Research Institute
Curated by ChEMBL
Assay Description
Displacement of [125I]DOI from human recombinant 5HT2C expressed in HEK293E cells
J Med Chem 50: 1365-79 (2007)
Article DOI: 10.1021/jm0612968
BindingDB Entry DOI: 10.7270/Q2XP74M8
5-hydroxytryptamine receptor 2B
(Homo sapiens (Human))
BDBM50205856
((R)-9-cyclopropyl-1,3,4,10b-tetrahydro-7-trifluoro...)
Show SMILES FC(F)(F)c1cc(cc2[C@@H]3CNCCN3C(=O)c12)C1CC1
Show InChI InChI=1S/C15H15F3N2O/c16-15(17,18)11-6-9(8-1-2-8)5-10-12-7-19-3-4-20(12)14(21)13(10)11/h5-6,8,12,19H,1-4,7H2/t12-/m0/s1
Reactome pathway
209n/an/an/an/an/an/an/an/a
Pharmaceutical Research Institute
Curated by ChEMBL
Assay Description
Displacement of [3H]LSD from human recombinant 5HT2B expressed in HEK293E cells
J Med Chem 50: 1365-79 (2007)
Article DOI: 10.1021/jm0612968
BindingDB Entry DOI: 10.7270/Q2XP74M8
5-hydroxytryptamine receptor 2A
(Homo sapiens (Human))
BDBM50205856
((R)-9-cyclopropyl-1,3,4,10b-tetrahydro-7-trifluoro...)
Show SMILES FC(F)(F)c1cc(cc2[C@@H]3CNCCN3C(=O)c12)C1CC1
Show InChI InChI=1S/C15H15F3N2O/c16-15(17,18)11-6-9(8-1-2-8)5-10-12-7-19-3-4-20(12)14(21)13(10)11/h5-6,8,12,19H,1-4,7H2/t12-/m0/s1
Reactome pathway
579n/an/an/an/an/an/an/an/a
Pharmaceutical Research Institute
Curated by ChEMBL
Assay Description
Displacement of [125I]DOI from human recombinant 5HT2A expressed in HEK293E cells
J Med Chem 50: 1365-79 (2007)
Article DOI: 10.1021/jm0612968
BindingDB Entry DOI: 10.7270/Q2XP74M8
5-hydroxytryptamine receptor 2A
(Homo sapiens (Human))
BDBM50205856
((R)-9-cyclopropyl-1,3,4,10b-tetrahydro-7-trifluoro...)
Show SMILES FC(F)(F)c1cc(cc2[C@@H]3CNCCN3C(=O)c12)C1CC1
Show InChI InChI=1S/C15H15F3N2O/c16-15(17,18)11-6-9(8-1-2-8)5-10-12-7-19-3-4-20(12)14(21)13(10)11/h5-6,8,12,19H,1-4,7H2/t12-/m0/s1
Reactome pathway
n/an/an/an/a 513n/an/an/an/a
Pharmaceutical Research Institute
Curated by ChEMBL
Assay Description
Activity at human 5HT2A expressed in HEK293E cells assessed as elevation of intracellular calcium by 384-FLIPR assay
J Med Chem 50: 1365-79 (2007)
Article DOI: 10.1021/jm0612968
BindingDB Entry DOI: 10.7270/Q2XP74M8
5-hydroxytryptamine receptor 2B
(Homo sapiens (Human))
BDBM50205856
((R)-9-cyclopropyl-1,3,4,10b-tetrahydro-7-trifluoro...)
Show SMILES FC(F)(F)c1cc(cc2[C@@H]3CNCCN3C(=O)c12)C1CC1
Show InChI InChI=1S/C15H15F3N2O/c16-15(17,18)11-6-9(8-1-2-8)5-10-12-7-19-3-4-20(12)14(21)13(10)11/h5-6,8,12,19H,1-4,7H2/t12-/m0/s1
Reactome pathway
n/an/an/an/a 2.98E+3n/an/an/an/a
Pharmaceutical Research Institute
Curated by ChEMBL
Assay Description
Activity at human 5HT2B expressed in HEK293E cells assessed as elevation of intracellular calcium by 384-FLIPR assay
J Med Chem 50: 1365-79 (2007)
Article DOI: 10.1021/jm0612968
BindingDB Entry DOI: 10.7270/Q2XP74M8
5-hydroxytryptamine receptor 2C
(Homo sapiens (Human))
BDBM50205856
((R)-9-cyclopropyl-1,3,4,10b-tetrahydro-7-trifluoro...)
Show SMILES FC(F)(F)c1cc(cc2[C@@H]3CNCCN3C(=O)c12)C1CC1
Show InChI InChI=1S/C15H15F3N2O/c16-15(17,18)11-6-9(8-1-2-8)5-10-12-7-19-3-4-20(12)14(21)13(10)11/h5-6,8,12,19H,1-4,7H2/t12-/m0/s1
Reactome pathway
n/an/an/an/a 14n/an/an/an/a
Pharmaceutical Research Institute
Curated by ChEMBL
Assay Description
Activity at human 5HT2C expressed in HEK293E cells assessed as elevation of intracellular calcium by 384-FLIPR assay
J Med Chem 50: 1365-79 (2007)
Article DOI: 10.1021/jm0612968
BindingDB Entry DOI: 10.7270/Q2XP74M8