BDBM50205909 CHEMBL223782::N-(1,3-benzodioxol-5-ylmethyl)-4-(2-furanylcarbonyl)-1-[2-(1H-imidazolyl)-4-pyrimidinyl]-2-piperazineacetamide
SMILES: O=C(CC1CN(CCN1c1ccnc(n1)-n1ccnc1)C(=O)c1ccco1)NCc1ccc2OCOc2c1
InChI Key: InChIKey=LODDVTSCZXYADZ-UHFFFAOYSA-N
Data: 1 IC50
Activity Spreadsheet -- Enzyme Inhibition Constant Data from BindingDB
Found 1 hit for monomerid = 50205909
Trg + Lig
Ki
nM
ΔG°
kcal/mole
IC50
nM
Kd
nM
EC50/IC50
nM
koff
s-1
kon
M-1s-1
pHTemp
°C
Nitric oxide synthase, inducible
(Homo sapiens (Human))
BDBM50205909
(CHEMBL223782 | N-(1,3-benzodioxol-5-ylmethyl)-4-(2...)
Show SMILES O=C(CC1CN(CCN1c1ccnc(n1)-n1ccnc1)C(=O)c1ccco1)NCc1ccc2OCOc2c1
Show InChI InChI=1S/C26H25N7O5/c34-24(29-14-18-3-4-20-22(12-18)38-17-37-20)13-19-15-31(25(35)21-2-1-11-36-21)9-10-33(19)23-5-6-28-26(30-23)32-8-7-27-16-32/h1-8,11-12,16,19H,9-10,13-15,17H2,(H,29,34)
NCI pathway
Reactome pathway
n/an/a 0.670n/an/an/an/an/an/a
Berlex Biosciences
Curated by ChEMBL
Assay Description
Inhibition of cytokine-induced iNOS expressed in human A172 cells assessed as inhibition of NO formation
J Med Chem 50: 1146-57 (2007)
Article DOI: 10.1021/jm061319i
BindingDB Entry DOI: 10.7270/Q2SX6CWJ