BDBM50205968 CHEMBL373881::N-[(1,3-benzodioxol-5-yl)methyl]-1-[2-(1H-imidazol-1-yl)pyrimidin-4-yl]-4-(methylsulfonyl)-2-piperazineacetamide
SMILES: CS(=O)(=O)N1CCN(C(CC(=O)NCc2ccc3OCOc3c2)C1)c1ccnc(n1)-n1ccnc1
InChI Key: InChIKey=KPPHWLDGUOOBEH-UHFFFAOYSA-N
Data: 1 IC50
Activity Spreadsheet -- Enzyme Inhibition Constant Data from BindingDB
Found 1 hit for monomerid = 50205968
Trg + Lig
Ki
nM
ΔG°
kcal/mole
IC50
nM
Kd
nM
EC50/IC50
nM
koff
s-1
kon
M-1s-1
pHTemp
°C
Nitric oxide synthase, inducible
(Homo sapiens (Human))
BDBM50205968
(CHEMBL373881 | N-[(1,3-benzodioxol-5-yl)methyl]-1-...)
Show SMILES CS(=O)(=O)N1CCN(C(CC(=O)NCc2ccc3OCOc3c2)C1)c1ccnc(n1)-n1ccnc1
Show InChI InChI=1S/C22H25N7O5S/c1-35(31,32)28-8-9-29(20-4-5-24-22(26-20)27-7-6-23-14-27)17(13-28)11-21(30)25-12-16-2-3-18-19(10-16)34-15-33-18/h2-7,10,14,17H,8-9,11-13,15H2,1H3,(H,25,30)
NCI pathway
Reactome pathway
n/an/a 0.700n/an/an/an/an/an/a
Berlex Biosciences
Curated by ChEMBL
Assay Description
Inhibition of cytokine-induced iNOS expressed in human A172 cells assessed as inhibition of NO formation
J Med Chem 50: 1146-57 (2007)
Article DOI: 10.1021/jm061319i
BindingDB Entry DOI: 10.7270/Q2SX6CWJ