BDBM50206390 CHEMBL3909328
SMILES: OC(=O)\C=C/C(=O)Nc1cccc(c1)-c1n[nH]c2ccc(NC(=O)c3ccccc3)cc12
InChI Key: InChIKey=XQTNOHIWMHEQIC-QXMHVHEDSA-N
Data: 1 IC50
Activity Spreadsheet -- Enzyme Inhibition Constant Data from BindingDB
Found 1 hit for monomerid = 50206390
Trg + Lig
Ki
nM
ΔG°
kcal/mole
IC50
nM
Kd
nM
EC50/IC50
nM
koff
s-1
kon
M-1s-1
pHTemp
°C
Aurora kinase A
(Homo sapiens (Human))
BDBM50206390
(CHEMBL3909328)
Show SMILES OC(=O)\C=C/C(=O)Nc1cccc(c1)-c1n[nH]c2ccc(NC(=O)c3ccccc3)cc12
Show InChI InChI=1S/C24H18N4O4/c29-21(11-12-22(30)31)25-17-8-4-7-16(13-17)23-19-14-18(9-10-20(19)27-28-23)26-24(32)15-5-2-1-3-6-15/h1-14H,(H,25,29)(H,26,32)(H,27,28)(H,30,31)/b12-11-
NCI pathway
Reactome pathway
n/an/a 950n/an/an/an/an/an/a
Taiwan National Health Research Institutes
Curated by ChEMBL
Assay Description
Inhibition of GST-tagged Aurora A (123 to 401 residues) (unknown origin) preincubated for 15 mins followed by tetra(LRRWSLG) substrate addition measu...
Eur J Med Chem 124: 186-199 (2016)
Article DOI: 10.1016/j.ejmech.2016.08.026
BindingDB Entry DOI: 10.7270/Q2668G5M