BDBM50206394 CHEMBL3970521
SMILES: Nc1cccc(c1)-c1n[nH]c2ccccc12
InChI Key: InChIKey=WUXVDMCUIORDRH-UHFFFAOYSA-N
Data: 1 IC50
Activity Spreadsheet -- Enzyme Inhibition Constant Data from BindingDB
Found 1 hit for monomerid = 50206394
Trg + Lig
Ki
nM
ΔG°
kcal/mole
IC50
nM
Kd
nM
EC50/IC50
nM
koff
s-1
kon
M-1s-1
pHTemp
°C
Aurora kinase A
(Homo sapiens (Human))
BDBM50206394
(CHEMBL3970521)
Show SMILES Nc1cccc(c1)-c1n[nH]c2ccccc12
Show InChI InChI=1S/C13H11N3/c14-10-5-3-4-9(8-10)13-11-6-1-2-7-12(11)15-16-13/h1-8H,14H2,(H,15,16)
NCI pathway
Reactome pathway
n/an/a 1.36E+4n/an/an/an/an/an/a
Taiwan National Health Research Institutes
Curated by ChEMBL
Assay Description
Inhibition of GST-tagged Aurora A (123 to 401 residues) (unknown origin) preincubated for 15 mins followed by tetra(LRRWSLG) substrate addition measu...
Eur J Med Chem 124: 186-199 (2016)
Article DOI: 10.1016/j.ejmech.2016.08.026
BindingDB Entry DOI: 10.7270/Q2668G5M