BDBM50206426 4-amino-3,5-dibromo-2-(2,4,5,7-tetrabromo-6-hydroxy-3-oxo-3H-xanthen-9-yl)benzoic acid::CHEMBL220275
SMILES: Nc1c(Br)cc(C(O)=O)c(c1Br)-c1c2cc(Br)c(O)c(Br)c2oc2c(Br)c(=O)c(Br)cc12
InChI Key: InChIKey=PSILLVDSFALROT-UHFFFAOYSA-N
Data: 2 IC50
Activity Spreadsheet -- Enzyme Inhibition Constant Data from BindingDB
Found 2 hits for monomerid = 50206426
Trg + Lig
Ki
nM
ΔG°
kcal/mole
IC50
nM
Kd
nM
EC50/IC50
nM
koff
s-1
kon
M-1s-1
pHTemp
°C
RmtA
(Emericella nidulans)
BDBM50206426
(4-amino-3,5-dibromo-2-(2,4,5,7-tetrabromo-6-hydrox...)
Show SMILES Nc1c(Br)cc(C(O)=O)c(c1Br)-c1c2cc(Br)c(O)c(Br)c2oc2c(Br)c(=O)c(Br)cc12 |(13.55,-25.84,;12.22,-26.62,;10.88,-25.85,;10.87,-24.31,;9.55,-26.64,;9.56,-28.18,;8.02,-28.16,;7.23,-29.48,;7.26,-26.82,;10.89,-28.92,;12.23,-28.16,;13.56,-28.92,;10.9,-30.46,;12.24,-31.22,;13.57,-30.44,;14.91,-31.2,;16.24,-30.42,;14.92,-32.76,;16.26,-33.52,;13.59,-33.54,;13.6,-35.08,;12.25,-32.77,;10.91,-33.55,;9.58,-32.78,;8.24,-33.56,;8.25,-35.1,;6.91,-32.79,;5.58,-33.56,;6.91,-31.24,;5.58,-30.47,;8.24,-30.47,;9.58,-31.24,)|
Show InChI InChI=1S/C20H7Br6NO5/c21-7-3-6(20(30)31)11(12(24)15(7)27)10-4-1-8(22)16(28)13(25)18(4)32-19-5(10)2-9(23)17(29)14(19)26/h1-3,28H,27H2,(H,30,31)
n/an/a 2.23E+4n/an/an/an/an/an/a
Universit£ degli Studi di Roma La Sapienza
Curated by ChEMBL
Assay Description
Inhibition of Aspergillus nidulans recombinant GST-RmtA expressed in BL21 cells
J Med Chem 50: 1241-53 (2007)
Article DOI: 10.1021/jm061213n
BindingDB Entry DOI: 10.7270/Q29887TV
Protein arginine N-methyltransferase 1 [11-371]
(Homo sapiens (Human))
BDBM50206426
(4-amino-3,5-dibromo-2-(2,4,5,7-tetrabromo-6-hydrox...)
Show SMILES Nc1c(Br)cc(C(O)=O)c(c1Br)-c1c2cc(Br)c(O)c(Br)c2oc2c(Br)c(=O)c(Br)cc12 |(13.55,-25.84,;12.22,-26.62,;10.88,-25.85,;10.87,-24.31,;9.55,-26.64,;9.56,-28.18,;8.02,-28.16,;7.23,-29.48,;7.26,-26.82,;10.89,-28.92,;12.23,-28.16,;13.56,-28.92,;10.9,-30.46,;12.24,-31.22,;13.57,-30.44,;14.91,-31.2,;16.24,-30.42,;14.92,-32.76,;16.26,-33.52,;13.59,-33.54,;13.6,-35.08,;12.25,-32.77,;10.91,-33.55,;9.58,-32.78,;8.24,-33.56,;8.25,-35.1,;6.91,-32.79,;5.58,-33.56,;6.91,-31.24,;5.58,-30.47,;8.24,-30.47,;9.58,-31.24,)|
Show InChI InChI=1S/C20H7Br6NO5/c21-7-3-6(20(30)31)11(12(24)15(7)27)10-4-1-8(22)16(28)13(25)18(4)32-19-5(10)2-9(23)17(29)14(19)26/h1-3,28H,27H2,(H,30,31)
n/an/a 4.80E+3n/an/an/an/an/an/a
Universit£ degli Studi di Roma La Sapienza
Curated by ChEMBL
Assay Description
Inhibition of human recombinant GST-PRMT1 expressed in BL21 cells
J Med Chem 50: 1241-53 (2007)
Article DOI: 10.1021/jm061213n
BindingDB Entry DOI: 10.7270/Q29887TV