BDBM50206607 CHEMBL3960765
SMILES: OC(=O)c1nccc(n1)-c1ccc(OC2CC2)c(Cl)c1
InChI Key: InChIKey=SKLFIIGEXZGVMW-UHFFFAOYSA-N
Data: 1 IC50
Activity Spreadsheet -- Enzyme Inhibition Constant Data from BindingDB
Found 1 hit for monomerid = 50206607
Trg + Lig
Ki
nM
ΔG°
kcal/mole
IC50
nM
Kd
nM
EC50/IC50
nM
koff
s-1
kon
M-1s-1
pHTemp
°C
Kynurenine 3-monooxygenase
(Homo sapiens (Human))
BDBM50206607
(CHEMBL3960765)
Show SMILES OC(=O)c1nccc(n1)-c1ccc(OC2CC2)c(Cl)c1
Show InChI InChI=1S/C14H11ClN2O3/c15-10-7-8(1-4-12(10)20-9-2-3-9)11-5-6-16-13(17-11)14(18)19/h1,4-7,9H,2-3H2,(H,18,19)
Reactome pathway
n/an/a 0.5n/an/an/an/an/an/a
Dr. Harisingh Gour University
Curated by ChEMBL
Assay Description
Inhibition of human KMO
Bioorg Med Chem Lett 26: 5712-5718 (2016)
Article DOI: 10.1016/j.bmcl.2016.10.058
BindingDB Entry DOI: 10.7270/Q2JH3P5D