BDBM50206673 (S)-3-(6-(4-chlorophenyl)-4-oxothieno[3,2-d]pyrimidin-3(4H)-yl)-N-((S)-1-isopropylpyrrolidin-3-yl)-N-methylpyrrolidine-1-carboxamide::CHEMBL232257
SMILES: CC(C)N1CC[C@@H](C1)N(C)C(=O)N1CC[C@@H](C1)n1cnc2cc(sc2c1=O)-c1ccc(Cl)cc1
InChI Key: InChIKey=RHEIAZQERJIKFS-PMACEKPBSA-N
Data: 1 KI  1 IC50
Activity Spreadsheet -- Enzyme Inhibition Constant Data from BindingDB
Found 2 hits for monomerid = 50206673
Trg + Lig
Ki
nM
ΔG°
kcal/mole
IC50
nM
Kd
nM
EC50/IC50
nM
koff
s-1
kon
M-1s-1
pHTemp
°C
Melanin-concentrating hormone receptor
(Homo sapiens (Human))
BDBM50206673
((S)-3-(6-(4-chlorophenyl)-4-oxothieno[3,2-d]pyrimi...)
Show SMILES CC(C)N1CC[C@@H](C1)N(C)C(=O)N1CC[C@@H](C1)n1cnc2cc(sc2c1=O)-c1ccc(Cl)cc1
Show InChI InChI=1S/C25H30ClN5O2S/c1-16(2)29-10-8-19(13-29)28(3)25(33)30-11-9-20(14-30)31-15-27-21-12-22(34-23(21)24(31)32)17-4-6-18(26)7-5-17/h4-7,12,15-16,19-20H,8-11,13-14H2,1-3H3/t19-,20-/m0/s1
Reactome pathway
5n/an/an/an/an/an/an/an/a
Neurocrine Biosciences Inc.
Curated by ChEMBL
Assay Description
Binding affinity to human MCHR1
Bioorg Med Chem Lett 17: 2535-9 (2007)
Article DOI: 10.1016/j.bmcl.2007.02.012
BindingDB Entry DOI: 10.7270/Q23778CV
Melanin-concentrating hormone receptor
(Homo sapiens (Human))
BDBM50206673
((S)-3-(6-(4-chlorophenyl)-4-oxothieno[3,2-d]pyrimi...)
Show SMILES CC(C)N1CC[C@@H](C1)N(C)C(=O)N1CC[C@@H](C1)n1cnc2cc(sc2c1=O)-c1ccc(Cl)cc1
Show InChI InChI=1S/C25H30ClN5O2S/c1-16(2)29-10-8-19(13-29)28(3)25(33)30-11-9-20(14-30)31-15-27-21-12-22(34-23(21)24(31)32)17-4-6-18(26)7-5-17/h4-7,12,15-16,19-20H,8-11,13-14H2,1-3H3/t19-,20-/m0/s1
Reactome pathway
n/an/a 23n/an/an/an/an/an/a
Neurocrine Biosciences Inc.
Curated by ChEMBL
Assay Description
Antagonist activity at human MCHR1 by [35S]GTPgammaS binding assay
Bioorg Med Chem Lett 17: 2535-9 (2007)
Article DOI: 10.1016/j.bmcl.2007.02.012
BindingDB Entry DOI: 10.7270/Q23778CV