BDBM50206692 (S)-3-(6-(4-chlorophenyl)-4-oxothieno[3,2-d]pyrimidin-3(4H)-yl)-N-methyl-N-((S)-pyrrolidin-3-yl)pyrrolidine-1-carboxamide::CHEMBL394822
SMILES: CN([C@H]1CCNC1)C(=O)N1CC[C@@H](C1)n1cnc2cc(sc2c1=O)-c1ccc(Cl)cc1
InChI Key: InChIKey=AZUPVGFTZXWNOW-IRXDYDNUSA-N
Data: 1 KI  1 IC50
Activity Spreadsheet -- Enzyme Inhibition Constant Data from BindingDB
Found 2 hits for monomerid = 50206692
Trg + Lig
Ki
nM
ΔG°
kcal/mole
IC50
nM
Kd
nM
EC50/IC50
nM
koff
s-1
kon
M-1s-1
pHTemp
°C
Melanin-concentrating hormone receptor
(Homo sapiens (Human))
BDBM50206692
((S)-3-(6-(4-chlorophenyl)-4-oxothieno[3,2-d]pyrimi...)
Show SMILES CN([C@H]1CCNC1)C(=O)N1CC[C@@H](C1)n1cnc2cc(sc2c1=O)-c1ccc(Cl)cc1
Show InChI InChI=1S/C22H24ClN5O2S/c1-26(16-6-8-24-11-16)22(30)27-9-7-17(12-27)28-13-25-18-10-19(31-20(18)21(28)29)14-2-4-15(23)5-3-14/h2-5,10,13,16-17,24H,6-9,11-12H2,1H3/t16-,17-/m0/s1
Reactome pathway
17n/an/an/an/an/an/an/an/a
Neurocrine Biosciences Inc.
Curated by ChEMBL
Assay Description
Binding affinity to human MCHR1
Bioorg Med Chem Lett 17: 2535-9 (2007)
Article DOI: 10.1016/j.bmcl.2007.02.012
BindingDB Entry DOI: 10.7270/Q23778CV
Melanin-concentrating hormone receptor
(Homo sapiens (Human))
BDBM50206692
((S)-3-(6-(4-chlorophenyl)-4-oxothieno[3,2-d]pyrimi...)
Show SMILES CN([C@H]1CCNC1)C(=O)N1CC[C@@H](C1)n1cnc2cc(sc2c1=O)-c1ccc(Cl)cc1
Show InChI InChI=1S/C22H24ClN5O2S/c1-26(16-6-8-24-11-16)22(30)27-9-7-17(12-27)28-13-25-18-10-19(31-20(18)21(28)29)14-2-4-15(23)5-3-14/h2-5,10,13,16-17,24H,6-9,11-12H2,1H3/t16-,17-/m0/s1
Reactome pathway
n/an/a 29n/an/an/an/an/an/a
Neurocrine Biosciences Inc.
Curated by ChEMBL
Assay Description
Antagonist activity at human MCHR1 by [35S]GTPgammaS binding assay
Bioorg Med Chem Lett 17: 2535-9 (2007)
Article DOI: 10.1016/j.bmcl.2007.02.012
BindingDB Entry DOI: 10.7270/Q23778CV