BDBM50206821 (R)-3-amino-1-(2-benzoylpiperazin-1-yl)-4-(2,4,5-trifluorophenyl)butan-1-one hydrochloride::CHEMBL535180
SMILES: N[C@@H](CC(=O)N1CCCCN1C(=O)c1ccccc1)Cc1cc(F)c(F)cc1F
InChI Key: InChIKey=NBEBUKKRRLTYFD-MRXNPFEDSA-N
Data: 1 KI  8 IC50
Activity Spreadsheet -- Enzyme Inhibition Constant Data from BindingDB
Found 9 hits for monomerid = 50206821
Trg + Lig
Ki
nM
ΔG°
kcal/mole
IC50
nM
Kd
nM
EC50/IC50
nM
koff
s-1
kon
M-1s-1
pHTemp
°C
Dipeptidyl peptidase IV
(Sus scrofa (pig))
BDBM50206821
((R)-3-amino-1-(2-benzoylpiperazin-1-yl)-4-(2,4,5-t...)
Show SMILES N[C@@H](CC(=O)N1CCCCN1C(=O)c1ccccc1)Cc1cc(F)c(F)cc1F
Show InChI InChI=1S/C21H22F3N3O2/c22-17-13-19(24)18(23)11-15(17)10-16(25)12-20(28)26-8-4-5-9-27(26)21(29)14-6-2-1-3-7-14/h1-3,6-7,11,13,16H,4-5,8-10,12,25H2/t16-/m1/s1
Reactome pathway
44n/an/an/an/an/an/an/an/a
Korea Research Institute of Chemical Technology
Curated by ChEMBL
Assay Description
Inhibition of pig kidney DPP4
Bioorg Med Chem Lett 17: 2622-8 (2007)
Article DOI: 10.1016/j.bmcl.2007.01.111
BindingDB Entry DOI: 10.7270/Q21V5FS4
Prolyl endopeptidase
(Homo sapiens (Human))
BDBM50206821
((R)-3-amino-1-(2-benzoylpiperazin-1-yl)-4-(2,4,5-t...)
Show SMILES N[C@@H](CC(=O)N1CCCCN1C(=O)c1ccccc1)Cc1cc(F)c(F)cc1F
Show InChI InChI=1S/C21H22F3N3O2/c22-17-13-19(24)18(23)11-15(17)10-16(25)12-20(28)26-8-4-5-9-27(26)21(29)14-6-2-1-3-7-14/h1-3,6-7,11,13,16H,4-5,8-10,12,25H2/t16-/m1/s1
n/an/a>1.00E+5n/an/an/an/an/an/a
Korea Research Institute of Chemical Technology
Curated by ChEMBL
Assay Description
Inhibition of POP
Bioorg Med Chem Lett 17: 2622-8 (2007)
Article DOI: 10.1016/j.bmcl.2007.01.111
BindingDB Entry DOI: 10.7270/Q21V5FS4
Aminopeptidase N
(Homo sapiens (Human))
BDBM50206821
((R)-3-amino-1-(2-benzoylpiperazin-1-yl)-4-(2,4,5-t...)
Show SMILES N[C@@H](CC(=O)N1CCCCN1C(=O)c1ccccc1)Cc1cc(F)c(F)cc1F
Show InChI InChI=1S/C21H22F3N3O2/c22-17-13-19(24)18(23)11-15(17)10-16(25)12-20(28)26-8-4-5-9-27(26)21(29)14-6-2-1-3-7-14/h1-3,6-7,11,13,16H,4-5,8-10,12,25H2/t16-/m1/s1
NCI pathway
Reactome pathway
n/an/a>1.00E+5n/an/an/an/an/an/a
Korea Research Institute of Chemical Technology
Curated by ChEMBL
Assay Description
Inhibition of APN
Bioorg Med Chem Lett 17: 2622-8 (2007)
Article DOI: 10.1016/j.bmcl.2007.01.111
BindingDB Entry DOI: 10.7270/Q21V5FS4
Dipeptidyl peptidase 9
(Homo sapiens (Human))
BDBM50206821
((R)-3-amino-1-(2-benzoylpiperazin-1-yl)-4-(2,4,5-t...)
Show SMILES N[C@@H](CC(=O)N1CCCCN1C(=O)c1ccccc1)Cc1cc(F)c(F)cc1F
Show InChI InChI=1S/C21H22F3N3O2/c22-17-13-19(24)18(23)11-15(17)10-16(25)12-20(28)26-8-4-5-9-27(26)21(29)14-6-2-1-3-7-14/h1-3,6-7,11,13,16H,4-5,8-10,12,25H2/t16-/m1/s1
n/an/a 1.00E+5n/an/an/an/an/an/a
Korea Research Institute of Chemical Technology
Curated by ChEMBL
Assay Description
Inhibition of DPP9
Bioorg Med Chem Lett 17: 3716-21 (2007)
Article DOI: 10.1016/j.bmcl.2007.04.031
BindingDB Entry DOI: 10.7270/Q2D21ZTR
Dipeptidyl peptidase 2 (DPP II)
(Homo sapiens (Human))
BDBM50206821
((R)-3-amino-1-(2-benzoylpiperazin-1-yl)-4-(2,4,5-t...)
Show SMILES N[C@@H](CC(=O)N1CCCCN1C(=O)c1ccccc1)Cc1cc(F)c(F)cc1F
Show InChI InChI=1S/C21H22F3N3O2/c22-17-13-19(24)18(23)11-15(17)10-16(25)12-20(28)26-8-4-5-9-27(26)21(29)14-6-2-1-3-7-14/h1-3,6-7,11,13,16H,4-5,8-10,12,25H2/t16-/m1/s1
n/an/a 7.20E+4n/an/an/an/an/an/a
Korea Research Institute of Chemical Technology
Curated by ChEMBL
Assay Description
Inhibition of DPP2
Bioorg Med Chem Lett 17: 2622-8 (2007)
Article DOI: 10.1016/j.bmcl.2007.01.111
BindingDB Entry DOI: 10.7270/Q21V5FS4
Dipeptidyl peptidase 4
(Homo sapiens (Human))
BDBM50206821
((R)-3-amino-1-(2-benzoylpiperazin-1-yl)-4-(2,4,5-t...)
Show SMILES N[C@@H](CC(=O)N1CCCCN1C(=O)c1ccccc1)Cc1cc(F)c(F)cc1F
Show InChI InChI=1S/C21H22F3N3O2/c22-17-13-19(24)18(23)11-15(17)10-16(25)12-20(28)26-8-4-5-9-27(26)21(29)14-6-2-1-3-7-14/h1-3,6-7,11,13,16H,4-5,8-10,12,25H2/t16-/m1/s1
Reactome pathway
n/an/a 50n/an/an/an/an/an/a
Korea Research Institute of Chemical Technology
Curated by ChEMBL
Assay Description
Inhibition of DPP4
Bioorg Med Chem Lett 17: 2622-8 (2007)
Article DOI: 10.1016/j.bmcl.2007.01.111
BindingDB Entry DOI: 10.7270/Q21V5FS4
Dipeptidyl peptidase VIII
(Homo sapiens (Human))
BDBM50206821
((R)-3-amino-1-(2-benzoylpiperazin-1-yl)-4-(2,4,5-t...)
Show SMILES N[C@@H](CC(=O)N1CCCCN1C(=O)c1ccccc1)Cc1cc(F)c(F)cc1F
Show InChI InChI=1S/C21H22F3N3O2/c22-17-13-19(24)18(23)11-15(17)10-16(25)12-20(28)26-8-4-5-9-27(26)21(29)14-6-2-1-3-7-14/h1-3,6-7,11,13,16H,4-5,8-10,12,25H2/t16-/m1/s1
n/an/a 1.00E+5n/an/an/an/an/an/a
Korea Research Institute of Chemical Technology
Curated by ChEMBL
Assay Description
Inhibition of DPP8
Bioorg Med Chem Lett 17: 3716-21 (2007)
Article DOI: 10.1016/j.bmcl.2007.04.031
BindingDB Entry DOI: 10.7270/Q2D21ZTR
Dipeptidyl peptidase VIII
(Homo sapiens (Human))
BDBM50206821
((R)-3-amino-1-(2-benzoylpiperazin-1-yl)-4-(2,4,5-t...)
Show SMILES N[C@@H](CC(=O)N1CCCCN1C(=O)c1ccccc1)Cc1cc(F)c(F)cc1F
Show InChI InChI=1S/C21H22F3N3O2/c22-17-13-19(24)18(23)11-15(17)10-16(25)12-20(28)26-8-4-5-9-27(26)21(29)14-6-2-1-3-7-14/h1-3,6-7,11,13,16H,4-5,8-10,12,25H2/t16-/m1/s1
n/an/a>1.00E+5n/an/an/an/an/an/a
Korea Research Institute of Chemical Technology
Curated by ChEMBL
Assay Description
Inhibition of DPP8
Bioorg Med Chem Lett 17: 2622-8 (2007)
Article DOI: 10.1016/j.bmcl.2007.01.111
BindingDB Entry DOI: 10.7270/Q21V5FS4
Dipeptidyl peptidase 9
(Homo sapiens (Human))
BDBM50206821
((R)-3-amino-1-(2-benzoylpiperazin-1-yl)-4-(2,4,5-t...)
Show SMILES N[C@@H](CC(=O)N1CCCCN1C(=O)c1ccccc1)Cc1cc(F)c(F)cc1F
Show InChI InChI=1S/C21H22F3N3O2/c22-17-13-19(24)18(23)11-15(17)10-16(25)12-20(28)26-8-4-5-9-27(26)21(29)14-6-2-1-3-7-14/h1-3,6-7,11,13,16H,4-5,8-10,12,25H2/t16-/m1/s1
n/an/a>1.00E+5n/an/an/an/an/an/a
Korea Research Institute of Chemical Technology
Curated by ChEMBL
Assay Description
Inhibition of DPP9
Bioorg Med Chem Lett 17: 2622-8 (2007)
Article DOI: 10.1016/j.bmcl.2007.01.111
BindingDB Entry DOI: 10.7270/Q21V5FS4