BDBM50206884 CHEMBL3908971
SMILES: CCc1cc(C(=O)Cc2ccc(OC)cc2)c(O)cc1O
InChI Key: InChIKey=GWWHYRTVXNSDII-UHFFFAOYSA-N
Data: 1 Kd
Activity Spreadsheet -- Enzyme Inhibition Constant Data from BindingDB
Found 1 hit for monomerid = 50206884
Trg + Lig
Ki
nM
ΔG°
kcal/mole
IC50
nM
Kd
nM
EC50/IC50
nM
koff
s-1
kon
M-1s-1
pHTemp
°C
Heat shock protein HSP 90-alpha
(Homo sapiens (Human))
BDBM50206884
(CHEMBL3908971)
Show SMILES CCc1cc(C(=O)Cc2ccc(OC)cc2)c(O)cc1O
Show InChI InChI=1S/C17H18O4/c1-3-12-9-14(17(20)10-15(12)18)16(19)8-11-4-6-13(21-2)7-5-11/h4-7,9-10,18,20H,3,8H2,1-2H3
NCI pathway
Reactome pathway
n/an/an/a 2.00E+4n/an/an/an/an/a
University of Auckland
Curated by ChEMBL
Assay Description
Binding affinity to 15N-labeled human HSP90alpha isoform 1 N-terminal ATP binding domain (9 to 236 residues) expressed in Escherichia coli BL21(DE3) ...
Bioorg Med Chem Lett 27: 277-281 (2017)
Article DOI: 10.1016/j.bmcl.2016.11.059
BindingDB Entry DOI: 10.7270/Q2CR5WBR