BDBM50207364 CHEMBL3936048
SMILES: CCS(=O)(=O)N(CCCCC(O)=O)c1ccccc1CNc1nc(Nc2ccc3NCCc3c2)ncc1C(F)(F)F
InChI Key: InChIKey=RVULLEYKHMQYRU-UHFFFAOYSA-N
Data: 2 IC50
Activity Spreadsheet -- Enzyme Inhibition Constant Data from BindingDB
Found 2 hits for monomerid = 50207364
Trg + Lig
Ki
nM
ΔG°
kcal/mole
IC50
nM
Kd
nM
EC50/IC50
nM
koff
s-1
kon
M-1s-1
pHTemp
°C
PTK2B protein tyrosine kinase 2 beta (PTK2B)
(Homo sapiens (Human))
BDBM50207364
(CHEMBL3936048)
Show SMILES CCS(=O)(=O)N(CCCCC(O)=O)c1ccccc1CNc1nc(Nc2ccc3NCCc3c2)ncc1C(F)(F)F
Show InChI InChI=1S/C27H31F3N6O4S/c1-2-41(39,40)36(14-6-5-9-24(37)38)23-8-4-3-7-19(23)16-32-25-21(27(28,29)30)17-33-26(35-25)34-20-10-11-22-18(15-20)12-13-31-22/h3-4,7-8,10-11,15,17,31H,2,5-6,9,12-14,16H2,1H3,(H,37,38)(H2,32,33,34,35)
n/an/a 256n/an/an/an/an/an/a
Gilead Sciences, Inc.
Curated by ChEMBL
Assay Description
Inhibition of full length recombinant human N-terminal His6-tagged PYK2 expressed in baculovirus infected sf21 cells
Bioorg Med Chem Lett 26: 5926-5930 (2016)
Article DOI: 10.1016/j.bmcl.2016.10.092
BindingDB Entry DOI: 10.7270/Q2ST7RTJ
Focal adhesion kinase 1
(Homo sapiens (Human))
BDBM50207364
(CHEMBL3936048)
Show SMILES CCS(=O)(=O)N(CCCCC(O)=O)c1ccccc1CNc1nc(Nc2ccc3NCCc3c2)ncc1C(F)(F)F
Show InChI InChI=1S/C27H31F3N6O4S/c1-2-41(39,40)36(14-6-5-9-24(37)38)23-8-4-3-7-19(23)16-32-25-21(27(28,29)30)17-33-26(35-25)34-20-10-11-22-18(15-20)12-13-31-22/h3-4,7-8,10-11,15,17,31H,2,5-6,9,12-14,16H2,1H3,(H,37,38)(H2,32,33,34,35)
NCI pathway
Reactome pathway
n/an/a 3.30n/an/an/an/an/an/a
Gilead Sciences, Inc.
Curated by ChEMBL
Assay Description
Inhibition of NH2-terminal His6-tagged FAK kinase domain (410 to 689 residues) (unknown origin) expressed in baculovirus infected sf9 cells using p(G...
Bioorg Med Chem Lett 26: 5926-5930 (2016)
Article DOI: 10.1016/j.bmcl.2016.10.092
BindingDB Entry DOI: 10.7270/Q2ST7RTJ