null
SMILES: Clc1ccc(Cn2c3ccccc3c3cc(ccc23)C(=O)C(=O)Nc2ccccc2)cc1
InChI Key: InChIKey=MZUDZDFEVSDDSC-UHFFFAOYSA-N
Activity Spreadsheet -- Enzyme Inhibition Constant Data from BindingDB
Found 1 hit for monomerid = 50207371
Trg + Lig
Ki
nM
ΔG°
kcal/mole
IC50
nM
Kd
nM
EC50/IC50
nM
koff
s-1
kon
M-1s-1
pHTemp
°C
Pancreatic triacylglycerol lipase
(Sus scrofa (Pig))
BDBM50207371
(CHEMBL3979181)
Show SMILES Clc1ccc(Cn2c3ccccc3c3cc(ccc23)C(=O)C(=O)Nc2ccccc2)cc1
Show InChI InChI=1S/C27H19ClN2O2/c28-20-13-10-18(11-14-20)17-30-24-9-5-4-8-22(24)23-16-19(12-15-25(23)30)26(31)27(32)29-21-6-2-1-3-7-21/h1-16H,17H2,(H,29,32)
n/an/a 1.39E+4n/an/an/an/an/an/a
Birla Institute of Technology and Science Pilani (Pilani Campus)
Curated by ChEMBL
Assay Description
Inhibition of porcine pancreatic lipase assessed as reduction in 4-nitrophenol formation from 4-nitrophenyl butyrate substrate preincubated for 30 mi...
Bioorg Med Chem 25: 609-620 (2017)
Article DOI: 10.1016/j.bmc.2016.11.031
BindingDB Entry DOI: 10.7270/Q2J968C6