BDBM50207373 CHEMBL3931385
SMILES: CCn1c2ccccc2c2cc(ccc12)C(=O)C(=O)Nc1ccc2ncccc2c1
InChI Key: InChIKey=CFMRRYQPIAMCCC-UHFFFAOYSA-N
Data: 1 IC50
Activity Spreadsheet -- Enzyme Inhibition Constant Data from BindingDB
Found 1 hit for monomerid = 50207373
Trg + Lig
Ki
nM
ΔG°
kcal/mole
IC50
nM
Kd
nM
EC50/IC50
nM
koff
s-1
kon
M-1s-1
pHTemp
°C
Pancreatic lipase
(Sus scrofa (Pig))
BDBM50207373
(CHEMBL3931385)
Show SMILES CCn1c2ccccc2c2cc(ccc12)C(=O)C(=O)Nc1ccc2ncccc2c1
Show InChI InChI=1S/C25H19N3O2/c1-2-28-22-8-4-3-7-19(22)20-15-17(9-12-23(20)28)24(29)25(30)27-18-10-11-21-16(14-18)6-5-13-26-21/h3-15H,2H2,1H3,(H,27,30)
n/an/a 1.55E+4n/an/an/an/an/an/a
Birla Institute of Technology and Science Pilani (Pilani Campus)
Curated by ChEMBL
Assay Description
Inhibition of porcine pancreatic lipase assessed as reduction in 4-nitrophenol formation from 4-nitrophenyl butyrate substrate preincubated for 30 mi...
Bioorg Med Chem 25: 609-620 (2017)
Article DOI: 10.1016/j.bmc.2016.11.031
BindingDB Entry DOI: 10.7270/Q2J968C6