BDBM50207522 CHEMBL3983700
SMILES: Cc1nnc2sc(C(=O)NCc3ccc(cc3)S(=O)(=O)C3CC3)c(N)c2c1C
InChI Key: InChIKey=XCDKHNJKTREZEB-UHFFFAOYSA-N
Data: 2 EC50
Activity Spreadsheet -- Enzyme Inhibition Constant Data from BindingDB
Found 2 hits for monomerid = 50207522
Trg + Lig
Ki
nM
ΔG°
kcal/mole
IC50
nM
Kd
nM
EC50/IC50
nM
koff
s-1
kon
M-1s-1
pHTemp
°C
Muscarinic acetylcholine receptor M4
(RAT)
BDBM50207522
(CHEMBL3983700)
Show SMILES Cc1nnc2sc(C(=O)NCc3ccc(cc3)S(=O)(=O)C3CC3)c(N)c2c1C
Show InChI InChI=1S/C19H20N4O3S2/c1-10-11(2)22-23-19-15(10)16(20)17(27-19)18(24)21-9-12-3-5-13(6-4-12)28(25,26)14-7-8-14/h3-6,14H,7-9,20H2,1-2H3,(H,21,24)
n/an/an/an/a 22n/an/an/an/a
Vanderbilt University Medical Center
Curated by ChEMBL
Assay Description
Positive allosteric modulation of rat M4 receptor expressed in CHO cells co-expressing Gqui5 by calcium mobilization assay
Bioorg Med Chem Lett 27: 171-175 (2017)
Article DOI: 10.1016/j.bmcl.2016.11.086
BindingDB Entry DOI: 10.7270/Q2WM1GC0
Muscarinic acetylcholine receptor M4
(RAT)
BDBM50207522
(CHEMBL3983700)
Show SMILES Cc1nnc2sc(C(=O)NCc3ccc(cc3)S(=O)(=O)C3CC3)c(N)c2c1C
Show InChI InChI=1S/C19H20N4O3S2/c1-10-11(2)22-23-19-15(10)16(20)17(27-19)18(24)21-9-12-3-5-13(6-4-12)28(25,26)14-7-8-14/h3-6,14H,7-9,20H2,1-2H3,(H,21,24)
n/an/an/an/a 22n/an/an/an/a
Vanderbilt University Medical Center
Curated by ChEMBL
Assay Description
Positive allosteric modulation of rat M4 receptor expressed in CHO cells co-expressing Gqui5 by calcium mobilization assay
Bioorg Med Chem Lett 27: 171-175 (2017)
Article DOI: 10.1016/j.bmcl.2016.11.086
BindingDB Entry DOI: 10.7270/Q2WM1GC0