BDBM50207526 CHEMBL3942363
SMILES: Cc1nnc2sc(C(=O)NCc3ccc(c(F)c3)S(=O)(=O)C(F)F)c(N)c2c1C
InChI Key: InChIKey=JOTCDPLGFQRPSE-UHFFFAOYSA-N
Data: 2 EC50
Activity Spreadsheet -- Enzyme Inhibition Constant Data from BindingDB
Found 2 hits for monomerid = 50207526
Trg + Lig
Ki
nM
ΔG°
kcal/mole
IC50
nM
Kd
nM
EC50/IC50
nM
koff
s-1
kon
M-1s-1
pHTemp
°C
Muscarinic acetylcholine receptor M4
(RAT)
BDBM50207526
(CHEMBL3942363)
Show SMILES Cc1nnc2sc(C(=O)NCc3ccc(c(F)c3)S(=O)(=O)C(F)F)c(N)c2c1C
Show InChI InChI=1S/C17H15F3N4O3S2/c1-7-8(2)23-24-16-12(7)13(21)14(28-16)15(25)22-6-9-3-4-11(10(18)5-9)29(26,27)17(19)20/h3-5,17H,6,21H2,1-2H3,(H,22,25)
n/an/an/an/a 23n/an/an/an/a
Vanderbilt University Medical Center
Curated by ChEMBL
Assay Description
Positive allosteric modulation of rat M4 receptor expressed in CHO cells co-expressing Gqui5 by calcium mobilization assay
Bioorg Med Chem Lett 27: 171-175 (2017)
Article DOI: 10.1016/j.bmcl.2016.11.086
BindingDB Entry DOI: 10.7270/Q2WM1GC0
Muscarinic acetylcholine receptor M4
(RAT)
BDBM50207526
(CHEMBL3942363)
Show SMILES Cc1nnc2sc(C(=O)NCc3ccc(c(F)c3)S(=O)(=O)C(F)F)c(N)c2c1C
Show InChI InChI=1S/C17H15F3N4O3S2/c1-7-8(2)23-24-16-12(7)13(21)14(28-16)15(25)22-6-9-3-4-11(10(18)5-9)29(26,27)17(19)20/h3-5,17H,6,21H2,1-2H3,(H,22,25)
n/an/an/an/a 23n/an/an/an/a
Vanderbilt University Medical Center
Curated by ChEMBL
Assay Description
Positive allosteric modulation of rat M4 receptor expressed in CHO cells co-expressing Gqui5 by calcium mobilization assay
Bioorg Med Chem Lett 27: 171-175 (2017)
Article DOI: 10.1016/j.bmcl.2016.11.086
BindingDB Entry DOI: 10.7270/Q2WM1GC0