BDBM50208001 3-(1-benzyl-piperidin-4-yl)-5,5-di-(4-fluorophenyl)-imidazolidin-2-one::CHEMBL222424
SMILES: Fc1ccc(cc1)C1(CN(C2CCN(Cc3ccccc3)CC2)C(=O)N1)c1ccc(F)cc1
InChI Key: InChIKey=DLFIQCGXPLUMEB-UHFFFAOYSA-N
Data: 2 KI  5 IC50
Activity Spreadsheet -- Enzyme Inhibition Constant Data from BindingDB
Found 7 hits for monomerid = 50208001
Trg + Lig
Ki
nM
ΔG°
kcal/mole
IC50
nM
Kd
nM
EC50/IC50
nM
koff
s-1
kon
M-1s-1
pHTemp
°C
Muscarinic acetylcholine receptor M3
(Homo sapiens (Human))
BDBM50208001
(3-(1-benzyl-piperidin-4-yl)-5,5-di-(4-fluorophenyl...)
Show SMILES Fc1ccc(cc1)C1(CN(C2CCN(Cc3ccccc3)CC2)C(=O)N1)c1ccc(F)cc1
Show InChI InChI=1S/C27H27F2N3O/c28-23-10-6-21(7-11-23)27(22-8-12-24(29)13-9-22)19-32(26(33)30-27)25-14-16-31(17-15-25)18-20-4-2-1-3-5-20/h1-13,25H,14-19H2,(H,30,33)
Reactome pathway
2.80n/an/an/an/an/an/an/an/a
Via Zambeletti 25
Curated by ChEMBL
Assay Description
Displacement of [3H]N-methyl-scopalamine from human muscarinic M3 receptor expressed in CHO K1 cells
J Med Chem 50: 1571-83 (2007)
Article DOI: 10.1021/jm061159a
BindingDB Entry DOI: 10.7270/Q2QV3M61
Muscarinic acetylcholine receptor M2
(Homo sapiens (Human))
BDBM50208001
(3-(1-benzyl-piperidin-4-yl)-5,5-di-(4-fluorophenyl...)
Show SMILES Fc1ccc(cc1)C1(CN(C2CCN(Cc3ccccc3)CC2)C(=O)N1)c1ccc(F)cc1
Show InChI InChI=1S/C27H27F2N3O/c28-23-10-6-21(7-11-23)27(22-8-12-24(29)13-9-22)19-32(26(33)30-27)25-14-16-31(17-15-25)18-20-4-2-1-3-5-20/h1-13,25H,14-19H2,(H,30,33)
207n/an/an/an/an/an/an/an/a
Via Zambeletti 25
Curated by ChEMBL
Assay Description
Displacement of [3H]N-methyl-scopalamine from human muscarinic M2 receptor expressed in CHO K1 cells
J Med Chem 50: 1571-83 (2007)
Article DOI: 10.1021/jm061159a
BindingDB Entry DOI: 10.7270/Q2QV3M61
Cytochrome P450 1A
(Homo sapiens (Human))
BDBM50208001
(3-(1-benzyl-piperidin-4-yl)-5,5-di-(4-fluorophenyl...)
Show SMILES Fc1ccc(cc1)C1(CN(C2CCN(Cc3ccccc3)CC2)C(=O)N1)c1ccc(F)cc1
Show InChI InChI=1S/C27H27F2N3O/c28-23-10-6-21(7-11-23)27(22-8-12-24(29)13-9-22)19-32(26(33)30-27)25-14-16-31(17-15-25)18-20-4-2-1-3-5-20/h1-13,25H,14-19H2,(H,30,33)
Reactome pathway
n/an/a>1.00E+5n/an/an/an/an/an/a
Via Zambeletti 25
Curated by ChEMBL
Assay Description
Inhibition of human CYP1A2 expressed in insect cells
J Med Chem 50: 1571-83 (2007)
Article DOI: 10.1021/jm061159a
BindingDB Entry DOI: 10.7270/Q2QV3M61
Cytochrome P450 3A4
(Homo sapiens (Human))
BDBM50208001
(3-(1-benzyl-piperidin-4-yl)-5,5-di-(4-fluorophenyl...)
Show SMILES Fc1ccc(cc1)C1(CN(C2CCN(Cc3ccccc3)CC2)C(=O)N1)c1ccc(F)cc1
Show InChI InChI=1S/C27H27F2N3O/c28-23-10-6-21(7-11-23)27(22-8-12-24(29)13-9-22)19-32(26(33)30-27)25-14-16-31(17-15-25)18-20-4-2-1-3-5-20/h1-13,25H,14-19H2,(H,30,33)
Reactome pathway
n/an/a 9.19E+4n/an/an/an/an/an/a
Via Zambeletti 25
Curated by ChEMBL
Assay Description
Inhibition of human CYP3A4 expressed in insect cells
J Med Chem 50: 1571-83 (2007)
Article DOI: 10.1021/jm061159a
BindingDB Entry DOI: 10.7270/Q2QV3M61
Cytochrome P450 2D6
(Homo sapiens (Human))
BDBM50208001
(3-(1-benzyl-piperidin-4-yl)-5,5-di-(4-fluorophenyl...)
Show SMILES Fc1ccc(cc1)C1(CN(C2CCN(Cc3ccccc3)CC2)C(=O)N1)c1ccc(F)cc1
Show InChI InChI=1S/C27H27F2N3O/c28-23-10-6-21(7-11-23)27(22-8-12-24(29)13-9-22)19-32(26(33)30-27)25-14-16-31(17-15-25)18-20-4-2-1-3-5-20/h1-13,25H,14-19H2,(H,30,33)
n/an/a 4.70E+3n/an/an/an/an/an/a
Via Zambeletti 25
Curated by ChEMBL
Assay Description
Inhibition of human CYP2D6 expressed in insect cells
J Med Chem 50: 1571-83 (2007)
Article DOI: 10.1021/jm061159a
BindingDB Entry DOI: 10.7270/Q2QV3M61
Cytochrome P450 2C9
(Homo sapiens (Human))
BDBM50208001
(3-(1-benzyl-piperidin-4-yl)-5,5-di-(4-fluorophenyl...)
Show SMILES Fc1ccc(cc1)C1(CN(C2CCN(Cc3ccccc3)CC2)C(=O)N1)c1ccc(F)cc1
Show InChI InChI=1S/C27H27F2N3O/c28-23-10-6-21(7-11-23)27(22-8-12-24(29)13-9-22)19-32(26(33)30-27)25-14-16-31(17-15-25)18-20-4-2-1-3-5-20/h1-13,25H,14-19H2,(H,30,33)
Reactome pathway
n/an/a 7.00E+3n/an/an/an/an/an/a
Via Zambeletti 25
Curated by ChEMBL
Assay Description
Inhibition of human CYP2C9 expressed in insect cells
J Med Chem 50: 1571-83 (2007)
Article DOI: 10.1021/jm061159a
BindingDB Entry DOI: 10.7270/Q2QV3M61
Cytochrome P450 2C19
(Homo sapiens (Human))
BDBM50208001
(3-(1-benzyl-piperidin-4-yl)-5,5-di-(4-fluorophenyl...)
Show SMILES Fc1ccc(cc1)C1(CN(C2CCN(Cc3ccccc3)CC2)C(=O)N1)c1ccc(F)cc1
Show InChI InChI=1S/C27H27F2N3O/c28-23-10-6-21(7-11-23)27(22-8-12-24(29)13-9-22)19-32(26(33)30-27)25-14-16-31(17-15-25)18-20-4-2-1-3-5-20/h1-13,25H,14-19H2,(H,30,33)
Reactome pathway
n/an/a 1.29E+4n/an/an/an/an/an/a
Via Zambeletti 25
Curated by ChEMBL
Assay Description
Inhibition of human CYP2C19 expressed in insect cells
J Med Chem 50: 1571-83 (2007)
Article DOI: 10.1021/jm061159a
BindingDB Entry DOI: 10.7270/Q2QV3M61