BDBM50208110 5-methyl-5-(4-bromo-thiophen-2-yl)-4-oxo-4,5-dihydro-furan-2-carboxylic acid::CHEMBL222472
SMILES: CC1(OC(=CC1=O)C(O)=O)c1cc(Br)cs1
InChI Key: InChIKey=YHFHOBUUFHAIJY-UHFFFAOYSA-N
Data: 2 EC50
Activity Spreadsheet -- Enzyme Inhibition Constant Data from BindingDB
Found 2 hits for monomerid = 50208110
Trg + Lig
Ki
nM
ΔG°
kcal/mole
IC50
nM
Kd
nM
EC50/IC50
nM
koff
s-1
kon
M-1s-1
pHTemp
°C
Hydroxycarboxylic acid receptor 2
(Homo sapiens (Human))
BDBM50208110
(5-methyl-5-(4-bromo-thiophen-2-yl)-4-oxo-4,5-dihyd...)
Show SMILES CC1(OC(=CC1=O)C(O)=O)c1cc(Br)cs1 |c:3|
Show InChI InChI=1S/C10H7BrO4S/c1-10(8-2-5(11)4-16-8)7(12)3-6(15-10)9(13)14/h2-4H,1H3,(H,13,14)
Reactome pathway
n/an/an/an/a 740n/an/an/an/a
Arena Pharmaceuticals
Curated by ChEMBL
Assay Description
Activity at GPR109a in CHO cells assessed as inhibition of forskolin-induced cAMP generation
J Med Chem 50: 1445-8 (2007)
Article DOI: 10.1021/jm070022x
BindingDB Entry DOI: 10.7270/Q2BK1C1Z
HM74 nicotinic acid GPCR
(Homo sapiens (Human))
BDBM50208110
(5-methyl-5-(4-bromo-thiophen-2-yl)-4-oxo-4,5-dihyd...)
Show SMILES CC1(OC(=CC1=O)C(O)=O)c1cc(Br)cs1 |c:3|
Show InChI InChI=1S/C10H7BrO4S/c1-10(8-2-5(11)4-16-8)7(12)3-6(15-10)9(13)14/h2-4H,1H3,(H,13,14)
n/an/an/an/a 4.10E+3n/an/an/an/a
Arena Pharmaceuticals
Curated by ChEMBL
Assay Description
Activity at GPR109b in CHO cells assessed as inhibition of forskolin-induced cAMP generation
J Med Chem 50: 1445-8 (2007)
Article DOI: 10.1021/jm070022x
BindingDB Entry DOI: 10.7270/Q2BK1C1Z