BDBM50208112 5-cyclopent-1-enyl-5-methyl-4-oxo-4,5-dihydro-furan-2-carboxylic acid::CHEMBL375754
SMILES: CC1(OC(=CC1=O)C(O)=O)C1=CCCC1
InChI Key: InChIKey=LDRXFNRHMPVZBO-UHFFFAOYSA-N
Data: 2 EC50
Activity Spreadsheet -- Enzyme Inhibition Constant Data from BindingDB
Found 2 hits for monomerid = 50208112
Trg + Lig
Ki
nM
ΔG°
kcal/mole
IC50
nM
Kd
nM
EC50/IC50
nM
koff
s-1
kon
M-1s-1
pHTemp
°C
Hydroxycarboxylic acid receptor 2
(Homo sapiens (Human))
BDBM50208112
(5-cyclopent-1-enyl-5-methyl-4-oxo-4,5-dihydro-fura...)
Show SMILES CC1(OC(=CC1=O)C(O)=O)C1=CCCC1 |c:3,t:11|
Show InChI InChI=1S/C11H12O4/c1-11(7-4-2-3-5-7)9(12)6-8(15-11)10(13)14/h4,6H,2-3,5H2,1H3,(H,13,14)
Reactome pathway
n/an/an/an/a 2.50E+3n/an/an/an/a
Arena Pharmaceuticals
Curated by ChEMBL
Assay Description
Activity at GPR109a in CHO cells assessed as inhibition of forskolin-induced cAMP generation
J Med Chem 50: 1445-8 (2007)
Article DOI: 10.1021/jm070022x
BindingDB Entry DOI: 10.7270/Q2BK1C1Z
HM74 nicotinic acid GPCR
(Homo sapiens (Human))
BDBM50208112
(5-cyclopent-1-enyl-5-methyl-4-oxo-4,5-dihydro-fura...)
Show SMILES CC1(OC(=CC1=O)C(O)=O)C1=CCCC1 |c:3,t:11|
Show InChI InChI=1S/C11H12O4/c1-11(7-4-2-3-5-7)9(12)6-8(15-11)10(13)14/h4,6H,2-3,5H2,1H3,(H,13,14)
n/an/an/an/a 5.10E+3n/an/an/an/a
Arena Pharmaceuticals
Curated by ChEMBL
Assay Description
Activity at GPR109b in CHO cells assessed as inhibition of forskolin-induced cAMP generation
J Med Chem 50: 1445-8 (2007)
Article DOI: 10.1021/jm070022x
BindingDB Entry DOI: 10.7270/Q2BK1C1Z