BDBM50208254 CHEMBL3883921
SMILES: CN(CCCCN1CCN(CC1)c1cccc2n(ccc12)S(=O)(=O)c1ccccc1)Cc1ccccc1
InChI Key: InChIKey=AFWXZBBWSCOFSI-UHFFFAOYSA-N
Data: 1 KI  1 IC50
Activity Spreadsheet -- Enzyme Inhibition Constant Data from BindingDB
Found 2 hits for monomerid = 50208254
Trg + Lig
Ki
nM
ΔG°
kcal/mole
IC50
nM
Kd
nM
EC50/IC50
nM
koff
s-1
kon
M-1s-1
pHTemp
°C
5-hydroxytryptamine receptor 6
(Homo sapiens (Human))
BDBM50208254
(CHEMBL3883921)
Show SMILES CN(CCCCN1CCN(CC1)c1cccc2n(ccc12)S(=O)(=O)c1ccccc1)Cc1ccccc1
Show InChI InChI=1S/C30H36N4O2S/c1-31(25-26-11-4-2-5-12-26)18-8-9-19-32-21-23-33(24-22-32)29-15-10-16-30-28(29)17-20-34(30)37(35,36)27-13-6-3-7-14-27/h2-7,10-17,20H,8-9,18-19,21-25H2,1H3
Reactome pathway
4n/an/an/an/an/an/an/an/a
Jagiellonian University Collegium Medicum
Curated by ChEMBL
Assay Description
Displacement of [3H]-LSD from human recombinant 5-HT6 receptor expressed in CHOK1 cell membranes measured after 60 mins by scintillation counter
Eur J Med Chem 124: 63-81 (2016)
Article DOI: 10.1016/j.ejmech.2016.08.016
BindingDB Entry DOI: 10.7270/Q2PZ5BT8
Cholinesterase
(Equus caballus (Horse))
BDBM50208254
(CHEMBL3883921)
Show SMILES CN(CCCCN1CCN(CC1)c1cccc2n(ccc12)S(=O)(=O)c1ccccc1)Cc1ccccc1
Show InChI InChI=1S/C30H36N4O2S/c1-31(25-26-11-4-2-5-12-26)18-8-9-19-32-21-23-33(24-22-32)29-15-10-16-30-28(29)17-20-34(30)37(35,36)27-13-6-3-7-14-27/h2-7,10-17,20H,8-9,18-19,21-25H2,1H3
n/an/a 6.22E+3n/an/an/an/an/an/a
Jagiellonian University Collegium Medicum
Curated by ChEMBL
Assay Description
Inhibition of equine serum BuChE preincubated for 5 mins followed by butyrylthiocholine iodide substrate addition measured after 5 mins by Ellman's m...
Eur J Med Chem 124: 63-81 (2016)
Article DOI: 10.1016/j.ejmech.2016.08.016
BindingDB Entry DOI: 10.7270/Q2PZ5BT8