BDBM50208262 CHEMBL3884312
SMILES: O=S(=O)(c1ccccc1)n1ccc2c(cccc12)N1CCN(CCCCNCc2ccccc2)CC1
InChI Key: InChIKey=NBBRVXGVAVZCJM-UHFFFAOYSA-N
Data: 1 KI  1 IC50
Activity Spreadsheet -- Enzyme Inhibition Constant Data from BindingDB
Found 2 hits for monomerid = 50208262
Trg + Lig
Ki
nM
ΔG°
kcal/mole
IC50
nM
Kd
nM
EC50/IC50
nM
koff
s-1
kon
M-1s-1
pHTemp
°C
5-hydroxytryptamine receptor 6
(Homo sapiens (Human))
BDBM50208262
(CHEMBL3884312)
Show SMILES O=S(=O)(c1ccccc1)n1ccc2c(cccc12)N1CCN(CCCCNCc2ccccc2)CC1
Show InChI InChI=1S/C29H34N4O2S/c34-36(35,26-12-5-2-6-13-26)33-19-16-27-28(14-9-15-29(27)33)32-22-20-31(21-23-32)18-8-7-17-30-24-25-10-3-1-4-11-25/h1-6,9-16,19,30H,7-8,17-18,20-24H2
Reactome pathway
8n/an/an/an/an/an/an/an/a
Jagiellonian University Collegium Medicum
Curated by ChEMBL
Assay Description
Displacement of [3H]-LSD from human recombinant 5-HT6 receptor expressed in CHOK1 cell membranes measured after 60 mins by scintillation counter
Eur J Med Chem 124: 63-81 (2016)
Article DOI: 10.1016/j.ejmech.2016.08.016
BindingDB Entry DOI: 10.7270/Q2PZ5BT8
Cholinesterase
(Equus caballus (Horse))
BDBM50208262
(CHEMBL3884312)
Show SMILES O=S(=O)(c1ccccc1)n1ccc2c(cccc12)N1CCN(CCCCNCc2ccccc2)CC1
Show InChI InChI=1S/C29H34N4O2S/c34-36(35,26-12-5-2-6-13-26)33-19-16-27-28(14-9-15-29(27)33)32-22-20-31(21-23-32)18-8-7-17-30-24-25-10-3-1-4-11-25/h1-6,9-16,19,30H,7-8,17-18,20-24H2
n/an/a 2.21E+3n/an/an/an/an/an/a
Jagiellonian University Collegium Medicum
Curated by ChEMBL
Assay Description
Inhibition of equine serum BuChE preincubated for 5 mins followed by butyrylthiocholine iodide substrate addition measured after 5 mins by Ellman's m...
Eur J Med Chem 124: 63-81 (2016)
Article DOI: 10.1016/j.ejmech.2016.08.016
BindingDB Entry DOI: 10.7270/Q2PZ5BT8