BDBM50208747 (R)-4-((3-(dimethylamino)pyrrolidin-1-yl)methyl)-N-(4-methyl-3-(4-(pyrimidin-5-yl)pyrimidin-2-ylamino)phenyl)-3-(trifluoromethyl)benzamide hydrochloride::CHEMBL536073
SMILES: CN(C)[C@@H]1CCN(Cc2ccc(cc2C(F)(F)F)C(=O)Nc2ccc(C)c(Nc3nccc(n3)-c3cncnc3)c2)C1
InChI Key: InChIKey=ZGBAJMQHJDFTQJ-XMMPIXPASA-N
Data: 2 IC50
Activity Spreadsheet -- Enzyme Inhibition Constant Data from BindingDB
Found 2 hits for monomerid = 50208747
Trg + Lig
Ki
nM
ΔG°
kcal/mole
IC50
nM
Kd
nM
EC50/IC50
nM
koff
s-1
kon
M-1s-1
pHTemp
°C
Tyrosine-protein kinase Lyn
(Homo sapiens (Human))
BDBM50208747
((R)-4-((3-(dimethylamino)pyrrolidin-1-yl)methyl)-N...)
Show SMILES CN(C)[C@@H]1CCN(Cc2ccc(cc2C(F)(F)F)C(=O)Nc2ccc(C)c(Nc3nccc(n3)-c3cncnc3)c2)C1
Show InChI InChI=1S/C30H31F3N8O/c1-19-4-7-23(13-27(19)39-29-36-10-8-26(38-29)22-14-34-18-35-15-22)37-28(42)20-5-6-21(25(12-20)30(31,32)33)16-41-11-9-24(17-41)40(2)3/h4-8,10,12-15,18,24H,9,11,16-17H2,1-3H3,(H,37,42)(H,36,38,39)/t24-/m1/s1
Reactome pathway
n/an/a 3.40n/an/an/an/an/an/a
Nippon Shinyaku Co. Ltd.
Curated by ChEMBL
Assay Description
Inhibition of human Lyn kinase expressed in Sf9 cells
Bioorg Med Chem Lett 17: 2712-7 (2007)
Article DOI: 10.1016/j.bmcl.2007.03.002
BindingDB Entry DOI: 10.7270/Q20C4WK9
Tyrosine-protein kinase ABL1
(Homo sapiens (Human))
BDBM50208747
((R)-4-((3-(dimethylamino)pyrrolidin-1-yl)methyl)-N...)
Show SMILES CN(C)[C@@H]1CCN(Cc2ccc(cc2C(F)(F)F)C(=O)Nc2ccc(C)c(Nc3nccc(n3)-c3cncnc3)c2)C1
Show InChI InChI=1S/C30H31F3N8O/c1-19-4-7-23(13-27(19)39-29-36-10-8-26(38-29)22-14-34-18-35-15-22)37-28(42)20-5-6-21(25(12-20)30(31,32)33)16-41-11-9-24(17-41)40(2)3/h4-8,10,12-15,18,24H,9,11,16-17H2,1-3H3,(H,37,42)(H,36,38,39)/t24-/m1/s1
Reactome pathway
n/an/a 12n/an/an/an/an/an/a
Nippon Shinyaku Co. Ltd.
Curated by ChEMBL
Assay Description
Inhibition of human Abl kinase expressed in Sf9 cells
Bioorg Med Chem Lett 17: 2712-7 (2007)
Article DOI: 10.1016/j.bmcl.2007.03.002
BindingDB Entry DOI: 10.7270/Q20C4WK9