BDBM50208881 5-Nitro-1H-benzoimidazole::5-nitrobenzimidazole::6-nitrobenzimidazole::CHEMBL164921
SMILES: [O-][N+](=O)c1ccc2nc[nH]c2c1
InChI Key: InChIKey=XPAZGLFMMUODDK-UHFFFAOYSA-N
Data: 2 KI  2 IC50  1 Kd
Activity Spreadsheet -- Enzyme Inhibition Constant Data from BindingDB
Found 5 hits for monomerid = 50208881
Trg + Lig
Ki
nM
ΔG°
kcal/mole
IC50
nM
Kd
nM
EC50/IC50
nM
koff
s-1
kon
M-1s-1
pHTemp
°C
cAMP and cAMP-inhibited cGMP 3',5'-cyclic phosphodiesterase 10A
(Homo sapiens (Human))
BDBM50208881
(5-Nitro-1H-benzoimidazole | 5-nitrobenzimidazole |...)
Show SMILES [O-][N+](=O)c1ccc2nc[nH]c2c1
Show InChI InChI=1S/C7H5N3O2/c11-10(12)5-1-2-6-7(3-5)9-4-8-6/h1-4H,(H,8,9)
Reactome pathway
5.00E+5n/an/an/an/an/an/an/an/a
Vrije Universiteit Amsterdam
Curated by ChEMBL
Assay Description
Inhibition of human N-terminal His6-tagged PDE10A2 catalytic domain expressed in Escherichia coli BL21(DE3) RIL cells using 3',5'-cGMP as substrate b...
J Med Chem 59: 7029-65 (2016)
Article DOI: 10.1021/acs.jmedchem.5b01813
cAMP and cAMP-inhibited cGMP 3',5'-cyclic phosphodiesterase 10A
(Homo sapiens (Human))
BDBM50208881
(5-Nitro-1H-benzoimidazole | 5-nitrobenzimidazole |...)
Show SMILES [O-][N+](=O)c1ccc2nc[nH]c2c1
Show InChI InChI=1S/C7H5N3O2/c11-10(12)5-1-2-6-7(3-5)9-4-8-6/h1-4H,(H,8,9)
Reactome pathway
5.00E+5n/an/an/an/an/an/an/an/a
Vrije Universiteit Amsterdam
Curated by ChEMBL
Assay Description
Inhibition of human N-terminal His6-tagged PDE10A2 catalytic domain expressed in Escherichia coli BL21(DE3) RIL cells using 3',5'-cGMP as substrate b...
J Med Chem 59: 7029-65 (2016)
Article DOI: 10.1021/acs.jmedchem.5b01813
Nicotinamide phosphoribosyltransferase
(Homo sapiens (Human))
BDBM50208881
(5-Nitro-1H-benzoimidazole | 5-nitrobenzimidazole |...)
Show SMILES [O-][N+](=O)c1ccc2nc[nH]c2c1
Show InChI InChI=1S/C7H5N3O2/c11-10(12)5-1-2-6-7(3-5)9-4-8-6/h1-4H,(H,8,9)
Reactome pathway
n/an/an/a 1.26E+5n/an/an/an/an/a
Genentech
Curated by ChEMBL
Assay Description
Binding affinity to N-terminal His6-tagged/biotinylated C-terminal Avi-tagged human NAMPT (2 to 491) by SPR analysis
Bioorg Med Chem Lett 24: 954-62 (2014)
Article DOI: 10.1016/j.bmcl.2013.12.062
BindingDB Entry DOI: 10.7270/Q2RV0Q50
Xanthine dehydrogenase/oxidase
(Homo sapiens (Human))
BDBM50208881
(5-Nitro-1H-benzoimidazole | 5-nitrobenzimidazole |...)
Show SMILES [O-][N+](=O)c1ccc2nc[nH]c2c1
Show InChI InChI=1S/C7H5N3O2/c11-10(12)5-1-2-6-7(3-5)9-4-8-6/h1-4H,(H,8,9)
n/an/a 8.68E+4n/an/an/an/an/an/a
Institute of Biological Chemistry and the Genomics Research Center
Curated by ChEMBL
Assay Description
Inhibition of human xanthine oxidase
Bioorg Med Chem 15: 3450-6 (2007)
Article DOI: 10.1016/j.bmc.2007.03.010
BindingDB Entry DOI: 10.7270/Q2WD407G
Cytochrome P450 2B1
(Rattus norvegicus)
BDBM50208881
(5-Nitro-1H-benzoimidazole | 5-nitrobenzimidazole |...)
Show SMILES [O-][N+](=O)c1ccc2nc[nH]c2c1
Show InChI InChI=1S/C7H5N3O2/c11-10(12)5-1-2-6-7(3-5)9-4-8-6/h1-4H,(H,8,9)
n/an/a 3.09E+5n/an/an/an/an/an/a
TBA
Curated by ChEMBL
Assay Description
Inhibitory potency to aminopyrine N-demethylase activity (P450) in hepatic microsomes from phenobarbitone-induced rats.
J Med Chem 25: 887-92 (1982)
BindingDB Entry DOI: 10.7270/Q2VT1T8J