BDBM50208928 CHEMBL3884344
SMILES: CC1(C)C(=O)N([C@H]2CCc3c2cccc3NS(C)(=O)=O)c2nc(Nc3ccccc3)ncc12
InChI Key: InChIKey=OPSONJKOCBCHTM-FQEVSTJZSA-N
Data: 2 IC50
Activity Spreadsheet -- Enzyme Inhibition Constant Data from BindingDB
Found 2 hits for monomerid = 50208928
Trg + Lig
Ki
nM
ΔG°
kcal/mole
IC50
nM
Kd
nM
EC50/IC50
nM
koff
s-1
kon
M-1s-1
pHTemp
°C
MAP/microtubule affinity-regulating kinase 4
(Homo sapiens (Human))
BDBM50208928
(CHEMBL3884344)
Show SMILES CC1(C)C(=O)N([C@H]2CCc3c2cccc3NS(C)(=O)=O)c2nc(Nc3ccccc3)ncc12 |r|
Show InChI InChI=1S/C24H25N5O3S/c1-24(2)18-14-25-23(26-15-8-5-4-6-9-15)27-21(18)29(22(24)30)20-13-12-16-17(20)10-7-11-19(16)28-33(3,31)32/h4-11,14,20,28H,12-13H2,1-3H3,(H,25,26,27)/t20-/m0/s1
NCI pathway
Reactome pathway
n/an/a 180n/an/an/an/an/an/a
Merck& Co.
Curated by ChEMBL
Assay Description
Inhibition of human MARK4 expressed in HEK293T cells coexpressing tau protein assessed as reduction in tau phosphorylation at Ser262 residues by Alph...
Bioorg Med Chem Lett 27: 114-120 (2017)
Article DOI: 10.1016/j.bmcl.2016.08.068
BindingDB Entry DOI: 10.7270/Q2N018JC
Serine/threonine-protein kinase c-TAK1
(Homo sapiens (Human))
BDBM50208928
(CHEMBL3884344)
Show SMILES CC1(C)C(=O)N([C@H]2CCc3c2cccc3NS(C)(=O)=O)c2nc(Nc3ccccc3)ncc12 |r|
Show InChI InChI=1S/C24H25N5O3S/c1-24(2)18-14-25-23(26-15-8-5-4-6-9-15)27-21(18)29(22(24)30)20-13-12-16-17(20)10-7-11-19(16)28-33(3,31)32/h4-11,14,20,28H,12-13H2,1-3H3,(H,25,26,27)/t20-/m0/s1
n/an/a 19n/an/an/an/an/an/a
Merck& Co.
Curated by ChEMBL
Assay Description
Inhibition of full length human MARK3 using biotin labeled peptide substrate by HTRF based assay
Bioorg Med Chem Lett 27: 114-120 (2017)
Article DOI: 10.1016/j.bmcl.2016.08.068
BindingDB Entry DOI: 10.7270/Q2N018JC