BDBM50208933 CHEMBL3884080
SMILES: C[C@@H](N1C(=O)C(C)(C)c2cnc(Nc3cccnc3)nc12)c1cccc(O)c1
InChI Key: InChIKey=UHEQNWGXIQUUOV-CYBMUJFWSA-N
Data: 1 IC50
Activity Spreadsheet -- Enzyme Inhibition Constant Data from BindingDB
Found 1 hit for monomerid = 50208933
Trg + Lig
Ki
nM
ΔG°
kcal/mole
IC50
nM
Kd
nM
EC50/IC50
nM
koff
s-1
kon
M-1s-1
pHTemp
°C
Serine/threonine-protein kinase c-TAK1
(Homo sapiens (Human))
BDBM50208933
(CHEMBL3884080)
Show SMILES C[C@@H](N1C(=O)C(C)(C)c2cnc(Nc3cccnc3)nc12)c1cccc(O)c1 |r|
Show InChI InChI=1S/C21H21N5O2/c1-13(14-6-4-8-16(27)10-14)26-18-17(21(2,3)19(26)28)12-23-20(25-18)24-15-7-5-9-22-11-15/h4-13,27H,1-3H3,(H,23,24,25)/t13-/m1/s1
n/an/a 1.80E+3n/an/an/an/an/an/a
Merck& Co.
Curated by ChEMBL
Assay Description
Inhibition of full length human MARK3 using biotin labeled peptide substrate by HTRF based assay
Bioorg Med Chem Lett 27: 114-120 (2017)
Article DOI: 10.1016/j.bmcl.2016.08.068
BindingDB Entry DOI: 10.7270/Q2N018JC