BDBM50208939 5-chloro-pyridin-3-yl-1H-indole-2-carboxylate::5-chloropyridin-3-yl 1H-indole-2-carboxylate::CHEMBL225515::med.21724, Compound 94
SMILES: Clc1cncc(OC(=O)c2cc3ccccc3[nH]2)c1
InChI Key: InChIKey=LJTINUKMKJKLBT-UHFFFAOYSA-N
Data: 3 IC50
Activity Spreadsheet -- Enzyme Inhibition Constant Data from BindingDB
Found 5 hits for monomerid = 50208939
Trg + Lig
Ki
nM
ΔG°
kcal/mole
IC50
nM
Kd
nM
EC50/IC50
nM
koff
s-1
kon
M-1s-1
pHTemp
°C
Papain-like protease (PLpro)
(Human SARS coronavirus (SARS-CoV))
BDBM50208939
(5-chloro-pyridin-3-yl-1H-indole-2-carboxylate | 5-...)
Show SMILES Clc1cncc(OC(=O)c2cc3ccccc3[nH]2)c1
Show InChI InChI=1S/C14H9ClN2O2/c15-10-6-11(8-16-7-10)19-14(18)13-5-9-3-1-2-4-12(9)17-13/h1-8,17H
n/an/a 65n/an/an/an/an/an/a
University of Alberta
Curated by ChEMBL
Assay Description
Inhibition of SARS coronavirus 3C-like protease
J Med Chem 50: 1850-64 (2007)
Article DOI: 10.1021/jm061425k
BindingDB Entry DOI: 10.7270/Q2RN37HR
3C-like proteinase (3CL-PRO)
(Human SARS coronavirus (SARS-CoV) (Severe acute re...)
BDBM50208939
(5-chloro-pyridin-3-yl-1H-indole-2-carboxylate | 5-...)
Show SMILES Clc1cncc(OC(=O)c2cc3ccccc3[nH]2)c1
Show InChI InChI=1S/C14H9ClN2O2/c15-10-6-11(8-16-7-10)19-14(18)13-5-9-3-1-2-4-12(9)17-13/h1-8,17H
n/an/a 65n/an/an/an/an/an/a
University of Bonn
Assay Description
This is a review article.
J Med Chem 59: 6595-628 (2016)
Article DOI: 10.1021/acs.jmedchem.5b01461
BindingDB Entry DOI: 10.7270/Q2PK0JH1
Replicase polyprotein 1ab
(2019-nCoV)
BDBM50208939
(5-chloro-pyridin-3-yl-1H-indole-2-carboxylate | 5-...)
Show SMILES Clc1cncc(OC(=O)c2cc3ccccc3[nH]2)c1
Show InChI InChI=1S/C14H9ClN2O2/c15-10-6-11(8-16-7-10)19-14(18)13-5-9-3-1-2-4-12(9)17-13/h1-8,17H
NCI pathway
Reactome pathway
n/an/a 25n/an/an/an/an/an/a
TBA
Citation and Details
3C-like proteinase (3CL-PRO)
(Human SARS coronavirus (SARS-CoV) (Severe acute re...)
BDBM50208939
(5-chloro-pyridin-3-yl-1H-indole-2-carboxylate | 5-...)
Show SMILES Clc1cncc(OC(=O)c2cc3ccccc3[nH]2)c1
Show InChI InChI=1S/C14H9ClN2O2/c15-10-6-11(8-16-7-10)19-14(18)13-5-9-3-1-2-4-12(9)17-13/h1-8,17H
n/an/a 65n/an/an/an/an/an/a
TBA
Citation and Details
3C-like proteinase (3CL-PRO)
(Human SARS coronavirus (SARS-CoV) (Severe acute re...)
BDBM50208939
(5-chloro-pyridin-3-yl-1H-indole-2-carboxylate | 5-...)
Show SMILES Clc1cncc(OC(=O)c2cc3ccccc3[nH]2)c1
Show InChI InChI=1S/C14H9ClN2O2/c15-10-6-11(8-16-7-10)19-14(18)13-5-9-3-1-2-4-12(9)17-13/h1-8,17H
n/an/a 65n/an/an/an/an/an/a
University of Bonn
Assay Description
This is a review article.
Med Res Rev (2020)
Article DOI: 10.1002/med.21724
BindingDB Entry DOI: 10.7270/Q2JS9ST6