BDBM50209038 CHEMBL3885499
SMILES: CCc1ccccc1-c1cccc2cc(CNCCCC(O)=O)sc12
InChI Key: InChIKey=SSFAGLSGBSHBQL-UHFFFAOYSA-N
Data: 2 EC50
Activity Spreadsheet -- Enzyme Inhibition Constant Data from BindingDB
Found 2 hits for monomerid = 50209038
Trg + Lig
Ki
nM
ΔG°
kcal/mole
IC50
nM
Kd
nM
EC50/IC50
nM
koff
s-1
kon
M-1s-1
pHTemp
°C
Sphingosine 1-phosphate receptor 4
(Homo sapiens (Human))
BDBM50209038
(CHEMBL3885499)
Show SMILES CCc1ccccc1-c1cccc2cc(CNCCCC(O)=O)sc12
Show InChI InChI=1S/C21H23NO2S/c1-2-15-7-3-4-9-18(15)19-10-5-8-16-13-17(25-21(16)19)14-22-12-6-11-20(23)24/h3-5,7-10,13,22H,2,6,11-12,14H2,1H3,(H,23,24)
NCI pathway
Reactome pathway
n/an/an/an/a>1.00E+5n/an/an/an/a
Harvard Medical School
Curated by ChEMBL
Assay Description
Agonist activity at recombinant human S1PR4 expressed in CHO cell membranes assessed as [35S]GTP-gammaS binding measured after 1.5 hrs by TopCount sc...
Bioorg Med Chem Lett 27: 1-5 (2017)
Article DOI: 10.1016/j.bmcl.2016.11.050
BindingDB Entry DOI: 10.7270/Q241702R
Sphingosine 1-phosphate receptor 5
(Homo sapiens (Human))
BDBM50209038
(CHEMBL3885499)
Show SMILES CCc1ccccc1-c1cccc2cc(CNCCCC(O)=O)sc12
Show InChI InChI=1S/C21H23NO2S/c1-2-15-7-3-4-9-18(15)19-10-5-8-16-13-17(25-21(16)19)14-22-12-6-11-20(23)24/h3-5,7-10,13,22H,2,6,11-12,14H2,1H3,(H,23,24)
NCI pathway
Reactome pathway
n/an/an/an/a>1.00E+5n/an/an/an/a
Harvard Medical School
Curated by ChEMBL
Assay Description
Agonist activity at recombinant human S1PR5 expressed in CHO cell membranes assessed as [35S]GTP-gammaS binding measured after 1.5 hrs by TopCount sc...
Bioorg Med Chem Lett 27: 1-5 (2017)
Article DOI: 10.1016/j.bmcl.2016.11.050
BindingDB Entry DOI: 10.7270/Q241702R