null
SMILES: CCc1ccccc1-c1cccc2cc(CNc3ccc(CC(O)=O)cc3)sc12
InChI Key: InChIKey=RNHYCLDILVZJFD-UHFFFAOYSA-N
Activity Spreadsheet -- Enzyme Inhibition Constant Data from BindingDB
Found 2 hits for monomerid = 50209050
Trg + Lig
Ki
nM
ΔG°
kcal/mole
IC50
nM
Kd
nM
EC50/IC50
nM
koff
s-1
kon
M-1s-1
pHTemp
°C
Sphingosine 1-phosphate receptor 4
(Homo sapiens (Human))
BDBM50209050
(CHEMBL3885195)
Show SMILES CCc1ccccc1-c1cccc2cc(CNc3ccc(CC(O)=O)cc3)sc12
Show InChI InChI=1S/C25H23NO2S/c1-2-18-6-3-4-8-22(18)23-9-5-7-19-15-21(29-25(19)23)16-26-20-12-10-17(11-13-20)14-24(27)28/h3-13,15,26H,2,14,16H2,1H3,(H,27,28)
NCI pathway
Reactome pathway
n/an/an/an/a 3.41E+3n/an/an/an/a
Harvard Medical School
Curated by ChEMBL
Assay Description
Agonist activity at recombinant human S1PR4 expressed in CHO cell membranes assessed as [35S]GTP-gammaS binding measured after 1.5 hrs by TopCount sc...
Bioorg Med Chem Lett 27: 1-5 (2017)
Article DOI: 10.1016/j.bmcl.2016.11.050
BindingDB Entry DOI: 10.7270/Q241702R
Sphingosine 1-phosphate receptor 5
(Homo sapiens (Human))
BDBM50209050
(CHEMBL3885195)
Show SMILES CCc1ccccc1-c1cccc2cc(CNc3ccc(CC(O)=O)cc3)sc12
Show InChI InChI=1S/C25H23NO2S/c1-2-18-6-3-4-8-22(18)23-9-5-7-19-15-21(29-25(19)23)16-26-20-12-10-17(11-13-20)14-24(27)28/h3-13,15,26H,2,14,16H2,1H3,(H,27,28)
NCI pathway
Reactome pathway
n/an/an/an/a 2.10E+3n/an/an/an/a
Harvard Medical School
Curated by ChEMBL
Assay Description
Agonist activity at recombinant human S1PR5 expressed in CHO cell membranes assessed as [35S]GTP-gammaS binding measured after 1.5 hrs by TopCount sc...
Bioorg Med Chem Lett 27: 1-5 (2017)
Article DOI: 10.1016/j.bmcl.2016.11.050
BindingDB Entry DOI: 10.7270/Q241702R