BDBM50209125 (2,2-dichloro-3-{4-[2-(5,6,7,8-tetrahydro-1,8-naphthyridin-2-yl)ethoxy]phenyl}-cyclopropyl)acetic acid::CHEMBL225743
SMILES: OC(=O)CC1C(c2ccc(OCCc3ccc4CCCNc4n3)cc2)C1(Cl)Cl
InChI Key: InChIKey=DGHLGBHZIKLZQQ-UHFFFAOYSA-N
Data: 3 IC50
Activity Spreadsheet -- Enzyme Inhibition Constant Data from BindingDB
Found 3 hits for monomerid = 50209125
Trg + Lig
Ki
nM
ΔG°
kcal/mole
IC50
nM
Kd
nM
EC50/IC50
nM
koff
s-1
kon
M-1s-1
pHTemp
°C
ITGAV/ITGB3
(Homo sapiens (Human))
BDBM50209125
((2,2-dichloro-3-{4-[2-(5,6,7,8-tetrahydro-1,8-naph...)
Show SMILES OC(=O)CC1C(c2ccc(OCCc3ccc4CCCNc4n3)cc2)C1(Cl)Cl |w:5.5,4.3|
Show InChI InChI=1S/C21H22Cl2N2O3/c22-21(23)17(12-18(26)27)19(21)13-4-7-16(8-5-13)28-11-9-15-6-3-14-2-1-10-24-20(14)25-15/h3-8,17,19H,1-2,9-12H2,(H,24,25)(H,26,27)
n/an/a 1.5n/an/an/an/an/an/a
Pfizer Global Research and Development
Curated by ChEMBL
Assay Description
Inhibition of human intergrin alphavbeta3 receptor expressed in HEK293 cells
Bioorg Med Chem 15: 3390-412 (2007)
Article DOI: 10.1016/j.bmc.2007.03.020
BindingDB Entry DOI: 10.7270/Q2057FK0
ITGAV/ITGB3
(Homo sapiens (Human))
BDBM50209125
((2,2-dichloro-3-{4-[2-(5,6,7,8-tetrahydro-1,8-naph...)
Show SMILES OC(=O)CC1C(c2ccc(OCCc3ccc4CCCNc4n3)cc2)C1(Cl)Cl |w:5.5,4.3|
Show InChI InChI=1S/C21H22Cl2N2O3/c22-21(23)17(12-18(26)27)19(21)13-4-7-16(8-5-13)28-11-9-15-6-3-14-2-1-10-24-20(14)25-15/h3-8,17,19H,1-2,9-12H2,(H,24,25)(H,26,27)
n/an/a 1.60n/an/an/an/an/an/a
Pfizer Global Research and Development
Curated by ChEMBL
Assay Description
Inhibition of human intergrin alphavbeta3 receptor by solid phase receptor assay
Bioorg Med Chem 15: 3390-412 (2007)
Article DOI: 10.1016/j.bmc.2007.03.020
BindingDB Entry DOI: 10.7270/Q2057FK0
ITGAV/ITGB6
(Homo sapiens (Human))
BDBM50209125
((2,2-dichloro-3-{4-[2-(5,6,7,8-tetrahydro-1,8-naph...)
Show SMILES OC(=O)CC1C(c2ccc(OCCc3ccc4CCCNc4n3)cc2)C1(Cl)Cl |w:5.5,4.3|
Show InChI InChI=1S/C21H22Cl2N2O3/c22-21(23)17(12-18(26)27)19(21)13-4-7-16(8-5-13)28-11-9-15-6-3-14-2-1-10-24-20(14)25-15/h3-8,17,19H,1-2,9-12H2,(H,24,25)(H,26,27)
n/an/a 4.50E+3n/an/an/an/an/an/a
Pfizer Global Research and Development
Curated by ChEMBL
Assay Description
Inhibition of integrin alphabeta6 receptor expressed in HT29 cells
Bioorg Med Chem 15: 3390-412 (2007)
Article DOI: 10.1016/j.bmc.2007.03.020
BindingDB Entry DOI: 10.7270/Q2057FK0